{"text_format":"1","workbook":"xlsx","n_sheets":9,"sheets":["Cover","Revision history","LINK BUDGET","Figures","Range","Input","UDP traffic","LookupTab","User Traffic Profile 1"],"not_rendered":{"charts":0,"images":4,"macros":1,"external_links":0,"defined_names":2,"comments":3,"pivot_tables":0},"unopened":[],"bounds":{"document_bytes":16777216,"sheet_cells":100000,"rows_first":2000,"rows_last":500,"rows_between":2000,"halvings":0,"cell_chars":16384,"cell_head_chars":4096},"cells_cut":0,"cells_raw":0,"read":"whole","date_system":"1904"}

{"sheet":"Cover","index":0,"n_rows":17,"n_cols":1,"rows_kept":17,"cut":false,"hidden":true,"merged":[]}
[]
[]
[]
[]
[]
[]
[]
[]
[]
[]
["ePMP System Release 1.0"]
["Link Budget Planning Results"]
[]
[]
[]
["Cambium Confidential Proprietary - for Engineering Use Only"]
["pmp-0436 \"ePMP System Release 1.0 Link Budget Planning Results\""]

{"sheet":"Revision history","index":1,"n_rows":7,"n_cols":3,"rows_kept":7,"cut":false,"hidden":true,"merged":[[0,2,0,3]]}
["Version","Date","Description"]
[0.1,"2013-08-23","Initial version covering R1.0"]
[0.2,"2013-09-06","Updated sensitivity values. Included Avenger throughput calculator."]
[0.3,"2013-09-25","Added CINR information and interference input; number of STAs up to 120; included updates to throughput calculator; added scheduling latency; updated antenna gains"]
[0.4,"2013-09-26","Changed STA antenna gain to 13 dBi and password protected spreadsheet"]
[0.5,"2013-09-26","This version shows only parameters available in release 1."]
[0.6,"2013-09-30","Updated frequency range, max center frequency and max power values for each band"]

{"sheet":"LINK BUDGET","index":2,"n_rows":69,"n_cols":16,"rows_kept":69,"cut":false,"hidden":false,"merged":[[14,2,14,3],[65,10,65,11],[66,10,66,11],[67,10,67,11],[65,4,65,5],[66,4,66,5],[67,4,67,5],[65,6,65,7],[66,6,66,7],[67,6,67,7],[65,8,65,9],[66,8,66,9],[67,8,67,9],[20,6,20,7],[43,4,43,5],[22,6,29,7],[1,1,1,11],[17,1,17,5],[20,4,20,5],[4,2,4,3],[39,4,39,5],[4,6,4,7],[8,6,8,7],[9,6,9,7],[5,5,5,7],[2,1,2,11],[18,6,18,7],[9,2,9,3],[10,6,10,7],[7,6,7,7],[22,1,29,1],[13,2,13,3],[38,4,38,5],[51,8,51,9],[39,10,39,11],[40,4,40,5],[41,4,41,5],[42,4,42,5],[47,4,47,5],[63,4,63,5],[64,4,64,5],[63,6,63,7],[64,6,64,7],[63,8,63,9],[8,2,8,3],[6,12,6,14],[3,1,3,11],[51,2,51,3],[20,10,20,11],[17,6,17,11],[6,5,6,7],[21,6,21,7],[46,4,46,5],[51,10,51,11],[51,4,51,7],[44,4,44,5],[45,4,45,5],[38,6,38,7],[39,6,39,7],[51,12,51,13],[60,8,60,9],[61,8,61,9],[62,8,62,9],[61,10,61,11],[3,12,5,14],[61,4,61,5],[62,4,62,5],[60,6,60,7],[61,6,61,7],[62,6,62,7],[30,1,37,1],[30,6,37,7],[56,14,56,15],[68,4,68,5],[68,6,68,7],[68,8,68,9],[68,10,68,11],[50,1,50,15],[60,10,60,11],[62,10,62,11],[64,10,64,11],[63,10,63,11],[64,8,64,9],[60,2,60,3],[51,14,51,15],[60,4,60,5]]}
[]
[null,"ePMP LINK BUDGET CALCULATOR"]
[null,"Cambium Networks confidential, not commercially binding"]
[null,"SYSTEM CONFIGURATION"]
[null,"Country","Others"]
[null,"Frequency band","5.7/5.8","[GHz]",null,"Lower frequency",null,null,{"$f":"Figures!B2*1000","v":5725},"[MHz]"]
[null,"Fade Margin",0,"[dB]",null,"Upper frequency",null,null,{"$f":"Figures!B3*1000","v":5875},"[MHz]"]
[null,"Channel Bandwidth",20,"[MHz]",null,null,"AP EIRP limit",null,{"$f":"Figures!B5","v":"-"},"[dBm]",{"$f":"IF(I8=\"-\",\"-\",ROUND((POWER(10,(I8/10)))/1000,1))","v":"-"},"[Watts]"]
[null,"AP antenna system","90° sector",null,null,null,"Max AP Tx Power",null,{"$f":"Figures!B4","v":23},"[dBm]",{"$f":"ROUND(POWER(10,(I9/10)),1)","v":199.5},"[mWatts]"]
[null,"Environment","rural",null,null,null,"STA EIRP limit",null,{"$f":"Figures!B6","v":"-"},"[dBm]",{"$f":"IF(I10=\"-\",\"-\",ROUND((POWER(10,(I10/10)))/1000,1))","v":"-"},"[Watts]"]
[null,"Max range",5,"[miles]",null,null,"Max STA Tx Power",null,{"$f":"Figures!B4","v":23},"[dBm]",{"$f":"ROUND(POWER(10,(I11/10)),1)","v":199.5},"[mWatts]"]
[null,"Max range limit",{"$f":"E60","v":15.912264293213822},"[miles]"]
[null,"Frame duration",5,"[ms]"]
[null,"Number of STAs/sector",20]
[null,"Duty cycle","50/50"]
[null,"UDP payload size",1472,"[bytes]"]
[null,"Interference level",0,"[dBm]"]
[null,"DOWNLINK BUDGET (AP to STA)",null,null,null,null,"UPLINK BUDGET (STA to AP)"]
[null,"AP Tx Power per chain",{"$f":"MIN(IF(I8=\"-\",20,MIN(20,I8-C21+C20-3)),I9-3)","v":20},"[dBm]",{"$f":"(POWER(10,(C19/10)))/1000","v":0.1},"[Watts]","STA Tx Power per chain",null,{"$f":"MIN(IF(I10=\"-\",20,MIN(20,I10-I21-3)),I11-3)","v":20},"[dBm]",{"$f":"(POWER(10,(I19/10)))/1000","v":0.1},"[Watts]"]
[null,"Cable Loss",1,"[dB]",{"$f":"(POWER(10,(C20/10)))/1000","v":1.2589254117941673E-3},"[Watts]"]
[null,"AP Antenna Gain",{"$f":"IF(C9=\"90° sector\",15,14)","v":15},"[dBi]",{"$f":"C9","v":"90° sector"},null,"STA Antenna Gain",null,{"$f":"C39","v":13},"[dBi]","Internal SM antenna"]
[null,"AP EIRP ",{"$f":"C19+3-C20+C21","v":37},"[dBm]",{"$f":"(POWER(10,(C22/10)))/1000","v":5.0118723362727327},"[Watts]","STA  EIRP ",null,{"$f":"I19+3+I21","v":36},"[dBm]",{"$f":"10^((I22-30)/10)","v":3.9810717055349727},"[Watts]"]
[null,"STA Rx Sensitivity ",{"$f":"Figures!I41","v":-68},"[dBm]","64QAM 5/6","MCS15","AP Rx Sensitivity ",null,{"$f":"Figures!H41","v":-70},"[dBm]","64QAM 5/6","MCS15"]
[null,null,{"$f":"Figures!I42","v":-70},"[dBm]","64QAM 3/4","MCS14",null,null,{"$f":"Figures!H42","v":-71},"[dBm]","64QAM 3/4","MCS14"]
[null,null,{"$f":"Figures!I43","v":-73},"[dBm]","64QAM 2/3","MCS13",null,null,{"$f":"Figures!H43","v":-73},"[dBm]","64QAM 2/3","MCS13"]
[null,null,{"$f":"Figures!I44","v":-77},"[dBm]","16QAM 3/4","MCS12",null,null,{"$f":"Figures!H44","v":-78},"[dBm]","16QAM 3/4","MCS12"]
[null,null,{"$f":"Figures!I45","v":-82},"[dBm]","16QAM 1/2","MCS11",null,null,{"$f":"Figures!H45","v":-81},"[dBm]","16QAM 1/2","MCS11"]
[null,null,{"$f":"Figures!I46","v":-83},"[dBm]","QPSK 3/4","MCS10",null,null,{"$f":"Figures!H46","v":-84},"[dBm]","QPSK 3/4","MCS10"]
[null,null,{"$f":"Figures!I47","v":-87},"[dBm]","QPSK 1/2","MCS9",null,null,{"$f":"Figures!H47","v":-86},"[dBm]","QPSK 1/2","MCS9"]
[null,null,{"$f":"Figures!I48","v":-90},"[dBm]","QPSK 1/2 SS","MCS1",null,null,{"$f":"Figures!H48","v":-89},"[dBm]","QPSK 1/2 SS","MCS1"]
[null,"STA CINR",{"$f":"IF($C$8=20,Figures!D41,Figures!E41)-3+98-10*LOG($C$8/20,10)","v":28},"[dB]","64QAM 5/6","MCS15","AP CINR ",null,{"$f":"IF($C$8=20,Figures!B41,Figures!C41)-3+98-10*LOG($C$8/20,10)","v":30},"[dB]","64QAM 5/6","MCS15"]
[null,null,{"$f":"IF($C$8=20,Figures!D42,Figures!E42)-3+98-10*LOG($C$8/20,10)","v":27},"[dB]","64QAM 3/4","MCS14",null,null,{"$f":"IF($C$8=20,Figures!B42,Figures!C42)-3+98-10*LOG($C$8/20,10)","v":28},"[dB]","64QAM 3/4","MCS14"]
[null,null,{"$f":"IF($C$8=20,Figures!D43,Figures!E43)-3+98-10*LOG($C$8/20,10)","v":25},"[dB]","64QAM 2/3","MCS13",null,null,{"$f":"IF($C$8=20,Figures!B43,Figures!C43)-3+98-10*LOG($C$8/20,10)","v":25},"[dB]","64QAM 2/3","MCS13"]
[null,null,{"$f":"IF($C$8=20,Figures!D44,Figures!E44)-3+98-10*LOG($C$8/20,10)","v":20},"[dB]","16QAM 3/4","MCS12",null,null,{"$f":"IF($C$8=20,Figures!B44,Figures!C44)-3+98-10*LOG($C$8/20,10)","v":21},"[dB]","16QAM 3/4","MCS12"]
[null,null,{"$f":"IF($C$8=20,Figures!D45,Figures!E45)-3+98-10*LOG($C$8/20,10)","v":17},"[dB]","16QAM 1/2","MCS11",null,null,{"$f":"IF($C$8=20,Figures!B45,Figures!C45)-3+98-10*LOG($C$8/20,10)","v":16},"[dB]","16QAM 1/2","MCS11"]
[null,null,{"$f":"IF($C$8=20,Figures!D46,Figures!E46)-3+98-10*LOG($C$8/20,10)","v":14},"[dB]","QPSK 3/4","MCS10",null,null,{"$f":"IF($C$8=20,Figures!B46,Figures!C46)-3+98-10*LOG($C$8/20,10)","v":15},"[dB]","QPSK 3/4","MCS10"]
[null,null,{"$f":"IF($C$8=20,Figures!D47,Figures!E47)-3+98-10*LOG($C$8/20,10)","v":12},"[dB]","QPSK 1/2","MCS9",null,null,{"$f":"IF($C$8=20,Figures!B47,Figures!C47)-3+98-10*LOG($C$8/20,10)","v":11},"[dB]","QPSK 1/2","MCS9"]
[null,null,{"$f":"IF($C$8=20,Figures!D48,Figures!E48)-3+98-10*LOG($C$8/20,10)","v":9},"[dB]","QPSK 1/2 SS","MCS1",null,null,{"$f":"IF($C$8=20,Figures!B48,Figures!C48)-3+98-10*LOG($C$8/20,10)","v":8},"[dB]","QPSK 1/2 SS","MCS1"]
[null,"STA Antenna Gain",13,"[dBi]","Internal SM antenna",null,"Cable Loss",null,1,"[dB]",{"$f":"(POWER(10,(I39/10)))/1000","v":1.2589254117941673E-3},"[Watts]"]
[null,null,null,null,null,null,"AP Antenna Gain",null,{"$f":"C21","v":15},"[dBi]",{"$f":"C9","v":"90° sector"}]
[null,"Total DL Gain (MCS15) =",{"$f":"$C$19-$C$20+$C$21-C23+$C$39","v":115},"[dB]","Total UL Gain (MCS15) =",null,{"$f":"$I$19+$I$21-I23-$I$39+$I$40","v":117},"[dB]"]
[null,"Total DL Gain (MCS14) =",117,"[dB]","Total UL Gain (MCS14) =",null,118,"[dB]"]
[null,"Total DL Gain (MCS13) =",120,"[dB]","Total UL Gain (MCS13) =",null,120,"[dB]"]
[null,"Total DL Gain (MCS12) =",124,"[dB]","Total UL Gain (MCS12) =",null,125,"[dB]"]
[null,"Total DL Gain (MCS11) =",129,"[dB]","Total UL Gain (MCS11) =",null,128,"[dB]"]
[null,"Total DL Gain (MCS10) =",130,"[dB]","Total UL Gain (MCS10) =",null,131,"[dB]"]
[null,"Total DL Gain (MCS9) =",134,"[dB]","Total UL Gain (MCS9) =",null,133,"[dB]"]
[null,"Total DL Gain (MCS1) =",137,"[dB]","Total UL Gain (MCS1) =",null,136,"[dB]"]
[]
[null,"The link is ",{"$f":"IF(ROUND(C48,0)=ROUND(G48,0), \"balanced\",IF(ROUND(C48,0)>ROUND(G48,0),\"uplink\",\"downlink\"))","v":"uplink"},{"$f":"IF(ROUND(C48,0)=ROUND(G48,0),\"\",\"limited by\")","v":"limited by"},{"$f":"IF(ROUND(C48,0)=ROUND(G48,0),\"\",IF(ROUND(C48,0)>ROUND(G48,0),ROUNDUP(C48-G48,0),ROUNDUP(G48-C48,0)))","v":1},{"$f":"IF(ROUND(C48,0)=ROUND(G48,0),\"\",\"dB\")","v":"dB"}]
[null,"COVERAGE AND CAPACITY"]
[null,"Modulation","System Gain",null,"Potential Range",null,null,null,"Max DL Throughput",null,"Max UL Throughput",null,"Max Total Throughput",null,"Capacity (Mbps)"]
[null,"64QAM 5/6       MCS15",{"$f":"MIN(C41,G41)","v":115},"dB",{"$f":"Range!F10","v":1.418182047915892},"mi",{"$f":"E53*1.60934","v":2.2823370969929617},"km",{"$f":"Figures!B52","v":43.2},"Mbps",{"$f":"Figures!C52","v":30.4},"Mbps",{"$f":"I53+K53","v":73.599999999999994},"Mbps","DL",{"$f":"IF(SUM(I62:J69)=0,0,1/SUM(I62:J69))","v":22.541531538160118}]
[null,"64QAM 3/4       MCS14",117,"dB",{"$f":"Range!F11","v":1.7853854186716098},"mi",{"$f":"E54*1.60934","v":2.8732921696849685},"km",{"$f":"Figures!B53","v":37.799999999999997},"Mbps",{"$f":"Figures!C53","v":26.200000000000003},"Mbps",{"$f":"I54+K54","v":64},"Mbps","UL",{"$f":"IF(SUM(K62:L69)=0,0,1/SUM(K62:L69))","v":16.554363803239703}]
[null,"64QAM 2/3       MCS13",120,"dB",{"$f":"Range!F12","v":2.5219239354956637},"mi",4.0586330663505912,"km",{"$f":"Figures!B54","v":34.200000000000003},"Mbps",{"$f":"Figures!C54","v":24.2},"Mbps",{"$f":"I55+K55","v":58.400000000000006},"Mbps","Total",{"$f":"P53+P54","v":39.095895341399824}]
[null,"16QAM 3/4       MCS12",124,"dB",{"$f":"Range!F13","v":3.9969800772718185},"mi",6.432499917556628,"km",{"$f":"Figures!B55","v":25.2},"Mbps",{"$f":"Figures!C55","v":18.2},"Mbps",{"$f":"I56+K56","v":43.4},"Mbps"]
[null,"16QAM 1/2       MCS11",128,"dB",{"$f":"Range!F14","v":6.3347865148708005},"mi",10.194825329842175,"km",{"$f":"Figures!B56","v":16.200000000000003},"Mbps",{"$f":"Figures!C56","v":12.2},"Mbps",28.400000000000002,"Mbps","Scheduling latency (ms)"]
[null,"QPSK 3/4         MCS10",130,"dB",{"$f":"Range!F15","v":7.9750237218618594},"mi",12.834524676541164,"km",{"$f":"Figures!B57","v":12.6},"Mbps",{"$f":"Figures!C57","v":8},"Mbps",20.6,"Mbps","DL",{"$f":"HLOOKUP('LINK BUDGET'!C14,'UDP traffic'!B35:DQ77,41)","v":17.5}]
[null,"QPSK 1/2         MCS9",133,"dB",{"$f":"Range!F16","v":11.26502042638697},"mi",18.129247973001608,"km",{"$f":"Figures!B58","v":9},"Mbps",{"$f":"Figures!C58","v":6},"Mbps",15,"Mbps","UL",{"$f":"HLOOKUP('LINK BUDGET'!C14,'UDP traffic'!B35:DQ77,42)","v":16.111111111111111}]
[null,"QPSK 1/2 SS     MCS1",136,"dB",{"$f":"Range!F17","v":15.912264293213822},"mi",25.608243417640733,"km",{"$f":"Figures!B59","v":3.5999999999999996},"Mbps",{"$f":"Figures!C59","v":2},"Mbps",5.6,"Mbps","Total",{"$f":"P58+P59","v":33.611111111111114}]
[null,null,"Actual range",null,"Area (sq mi)",null,"% Area",null,"DL Time",null,"UL Time"]
[null,"64QAM 5/6",{"$f":"MIN(E53,$C$11)","v":1.418182047915892},"mi",{"$f":"C62^2*3.14","v":6.3152946080370684},null,{"$f":"E62/SUM($E$62:$F$69)","v":8.0449612841236542E-2},null,{"$f":"IF(I53=0,0,G62/I53)","v":1.8622595565101049E-3},null,{"$f":"IF(K53=0,0,G62/K53)","v":2.6463688434617285E-3}]
[null,"64QAM 3/4",{"$f":"MIN(E54,$C$11)","v":1.7853854186716098},"mi",{"$f":"C63^2*3.14-C62^2*3.14","v":3.693772824627259},null,4.7054430886971449E-2,null,{"$f":"IF(I54=0,0,G63/I54)","v":1.2448262139410438E-3},null,{"$f":"IF(K54=0,0,G63/K54)","v":1.7959706445408949E-3}]
[null,"64QAM 2/3",2.5219239354956637,"mi",{"$f":"C64^2*3.14-C63^2*3.14","v":9.961647623713116},null,0.1268999697288295,null,3.7105254306675291E-3,null,5.2438004020177479E-3]
[null,"16QAM 3/4",3.9969800772718185,"mi",30.193453121281152,null,0.38462997606727584,null,1.5263094288383962E-2,null,2.1133515168531639E-2]
[null,"16QAM 1/2",5,"mi",28.335831822341405,null,0.36096601047568666,null,2.2281852498499174E-2,null,2.958737790784317E-2]
[null,"QPSK 3/4",5,"mi",0,null,0,null,0,null,0]
[null,"QPSK 1/2",5,"mi",0,null,0,null,0,null,0]
[null,"QPSK 1/2 SS",5,"mi",0,null,0,null,0,null,0]

{"sheet":"Figures","index":3,"n_rows":59,"n_cols":10,"rows_kept":59,"cut":false,"hidden":true,"merged":[[18,1,18,3],[18,4,18,6],[28,1,28,3],[28,4,28,6]]}
["OUTPUTS",null,null,"Frequency band","Lower frequency","Upper frequency","Max center frequency","MAX Tx power FCC","MAX Tx power ETSI","MAX Tx power Others"]
["Lower Frequency:",{"$f":"VLOOKUP('LINK BUDGET'!C6,Figures!D2:F8,2)","v":5.7249999999999996},null,2.4,2.4119999999999999,2.472,"2460 (TBD)","23 (TBD)","(TBD)","23 (TBD)"]
["Upper Frequency:",{"$f":"VLOOKUP('LINK BUDGET'!C6,Figures!D2:F8,3)","v":5.875},null,5.0999999999999996,5.15,5.25,{"$f":"IF('LINK BUDGET'!C8=20,5240,5230)","v":5240},"X","X",18]
["Max Tx power:",{"$f":"IF('LINK BUDGET'!C5=\"Others\",VLOOKUP('LINK BUDGET'!C6,Figures!D2:J8,7),IF('LINK BUDGET'!C5=\"FCC\",VLOOKUP('LINK BUDGET'!C6,Figures!D2:J8,5),VLOOKUP('LINK BUDGET'!C6,Figures!D2:J8,6)))","v":23},null,5.2,5.25,5.35,{"$f":"IF('LINK BUDGET'!C5=\"FCC\",5320,5340)-IF('LINK BUDGET'!C8=20,0,10)","v":5340},{"$f":"IF('LINK BUDGET'!C8=20,12,13)","v":12},"X",18]
["AP EIRP limit:",{"$f":"VLOOKUP('LINK BUDGET'!C6,Figures!A21:H27,IF('LINK BUDGET'!C5=\"FCC\",4,IF('LINK BUDGET'!C5=\"ETSI\",7,8)))","v":"-"},null,"5.4 lower",5.47,5.55,{"$f":"IF('LINK BUDGET'!C8=20,5540,5530)","v":5540},10,"X","X"]
["STA EIRP limit: ",{"$f":"VLOOKUP('LINK BUDGET'!C6,Figures!A31:H37,IF('LINK BUDGET'!C5=\"FCC\",4,IF('LINK BUDGET'!C5=\"ETSI\",7,8)))","v":"-"},null,"5.4 upper",5.55,5.7249999999999996,{"$f":"IF('LINK BUDGET'!C8=20,5705,5695)","v":5705},13,"X","X"]
["Max center freq:",{"$f":"IF('LINK BUDGET'!C8=20,VLOOKUP('LINK BUDGET'!C6,Figures!D2:J8,4),VLOOKUP('LINK BUDGET'!C6,Figures!D2:J8,4)-10)","v":5865},null,5.4,5.47,5.7249999999999996,{"$f":"IF('LINK BUDGET'!C8=20,5715,5705)","v":5715},"X",15,19]
[null,null,null,"5.7/5.8",5.7249999999999996,{"$f":"IF('LINK BUDGET'!C5=\"FCC\",5.85,5.875)","v":5.875},{"$f":"IF('LINK BUDGET'!C5=\"FCC\",5835,5865)-IF('LINK BUDGET'!C8=20,0,10)","v":5865},23,23,23]
[]
[]
["Supported bands"]
["FCC","ETSI","Others"]
[2.4,2.4,2.4]
[5.2,5.4,5.0999999999999996]
["5.4 lower","5.7/5.8",5.2]
["5.4 upper",null,5.4]
["5.7/5.8",null,"5.7/5.8"]
[]
["AP EIRP limits","FCC",null,null,"ETSI",null,null,"Others"]
["Band","max EIRP","max density","EIRP limit","max EIRP","max density","EIRP limit","EIRP limit"]
[2.4,36,23,{"$f":"IF(B21=\"X\",\"X\",MIN(B21,C21+10*LOG10('LINK BUDGET'!$C$8)))","v":36},20,7,{"$f":"IF(E21=\"X\",\"X\",MIN(E21,F21+10*LOG10('LINK BUDGET'!$C$8)))","v":20},"-"]
[5.0999999999999996,"X","X",{"$f":"IF(B22=\"X\",\"X\",MIN(B22,C22+10*LOG10('LINK BUDGET'!$C$8)))","v":"X"},"X","X",{"$f":"IF(E22=\"X\",\"X\",MIN(E22,F22+10*LOG10('LINK BUDGET'!$C$8)))","v":"X"},"-"]
[5.2,30,10,{"$f":"IF(B23=\"X\",\"X\",MIN(B23,C23+10*LOG10('LINK BUDGET'!$C$8)))","v":23.010299956639813},"X","X",{"$f":"IF(E23=\"X\",\"X\",MIN(E23,F23+10*LOG10('LINK BUDGET'!$C$8)))","v":"X"},"-"]
[5.4,"X","X",{"$f":"IF(B24=\"X\",\"X\",MIN(B24,C24+10*LOG10('LINK BUDGET'!$C$8)))","v":"X"},30,17,{"$f":"IF(E24=\"X\",\"X\",MIN(E24,F24+10*LOG10('LINK BUDGET'!$C$8)))","v":30},"-"]
["5.4 lower",30,17,{"$f":"IF(B25=\"X\",\"X\",MIN(B25,C25+10*LOG10('LINK BUDGET'!$C$8)))","v":30},"X","X",{"$f":"IF(E25=\"X\",\"X\",MIN(E25,F25+10*LOG10('LINK BUDGET'!$C$8)))","v":"X"},"-"]
["5.4 upper",30,17,{"$f":"IF(B26=\"X\",\"X\",MIN(B26,C26+10*LOG10('LINK BUDGET'!$C$8)))","v":30},"X","X",{"$f":"IF(E26=\"X\",\"X\",MIN(E26,F26+10*LOG10('LINK BUDGET'!$C$8)))","v":"X"},"-"]
["5.7/5.8",36,23,{"$f":"IF(B27=\"X\",\"X\",MIN(B27,C27+10*LOG10('LINK BUDGET'!$C$8)))","v":36},36,23,{"$f":"IF(E27=\"X\",\"X\",MIN(E27,F27+10*LOG10('LINK BUDGET'!$C$8)))","v":36},"-"]
[]
["STA EIRP limits","FCC",null,null,"ETSI",null,null,"Others"]
["Band","max EIRP","max density","EIRP limit","max EIRP","max density","EIRP limit","EIRP limit"]
[2.4,"-","-",{"$f":"30+6+('LINK BUDGET'!I21-6)/3","v":38.333333333333336},20,7,{"$f":"IF(E31=\"X\",\"X\",MIN(E31,F31+10*LOG10('LINK BUDGET'!$C$8)))","v":20},"-"]
[5.0999999999999996,"X","X",{"$f":"IF(B32=\"X\",\"X\",MIN(B32,C32+10*LOG10('LINK BUDGET'!$C$8)))","v":"X"},"X","X",{"$f":"IF(E32=\"X\",\"X\",MIN(E32,F32+10*LOG10('LINK BUDGET'!$C$8)))","v":"X"},"-"]
[5.2,30,10,{"$f":"IF(B33=\"X\",\"X\",MIN(B33,C33+10*LOG10('LINK BUDGET'!$C$8)))","v":23.010299956639813},"X","X",{"$f":"IF(E33=\"X\",\"X\",MIN(E33,F33+10*LOG10('LINK BUDGET'!$C$8)))","v":"X"},"-"]
[5.4,"X","X",{"$f":"IF(B34=\"X\",\"X\",MIN(B34,C34+10*LOG10('LINK BUDGET'!$C$8)))","v":"X"},30,17,{"$f":"IF(E34=\"X\",\"X\",MIN(E34,F34+10*LOG10('LINK BUDGET'!$C$8)))","v":30},"-"]
["5.4 lower",30,17,{"$f":"IF(B35=\"X\",\"X\",MIN(B35,C35+10*LOG10('LINK BUDGET'!$C$8)))","v":30},"X","X",{"$f":"IF(E35=\"X\",\"X\",MIN(E35,F35+10*LOG10('LINK BUDGET'!$C$8)))","v":"X"},"-"]
["5.4 upper",30,17,{"$f":"IF(B36=\"X\",\"X\",MIN(B36,C36+10*LOG10('LINK BUDGET'!$C$8)))","v":30},"X","X",{"$f":"IF(E36=\"X\",\"X\",MIN(E36,F36+10*LOG10('LINK BUDGET'!$C$8)))","v":"X"},"-"]
["5.7/5.8","-","-","-",36,23,{"$f":"IF(E37=\"X\",\"X\",MIN(E37,F37+10*LOG10('LINK BUDGET'!$C$8)))","v":36},"-"]
[]
["SENSITIVITY (Combined)",null,null,null,null,null,"SENSITIVITY (Output)"]
["Modulation","AP sens 20MHz","AP sens 40MHz","STA sens 20MHz","STA sens 40MHz",null,"Modulation","AP","STA"]
["64QAM 5/6",-65,{"$f":"B41+3","v":-62},-67,{"$f":"C41","v":-62},null,"64QAM 5/6",{"$f":"$H$55+'LINK BUDGET'!C31","v":-70},{"$f":"$H$55+'LINK BUDGET'!I31","v":-68}]
["64QAM 3/4",-67,{"$f":"B42+3","v":-64},-68,{"$f":"C42","v":-64},null,"64QAM 3/4",{"$f":"$H$55+'LINK BUDGET'!C32","v":-71},{"$f":"$H$55+'LINK BUDGET'!I32","v":-70}]
["64QAM 2/3",-70,-67,-70,-67,null,"64QAM 2/3",{"$f":"$H$55+'LINK BUDGET'!C33","v":-73},{"$f":"$H$55+'LINK BUDGET'!I33","v":-73}]
["16QAM 3/4",-74,-71,-75,-71,null,"16QAM 3/4",{"$f":"$H$55+'LINK BUDGET'!C34","v":-78},{"$f":"$H$55+'LINK BUDGET'!I34","v":-77}]
["16QAM 1/2",-79,-76,-78,-76,null,"16QAM 1/2",{"$f":"$H$55+'LINK BUDGET'!C35","v":-81},{"$f":"$H$55+'LINK BUDGET'!I35","v":-82}]
["QPSK 3/4",-80,-77,-81,-77,null,"QPSK 3/4",{"$f":"$H$55+'LINK BUDGET'!C36","v":-84},{"$f":"$H$55+'LINK BUDGET'!I36","v":-83}]
["QPSK 1/2",-84,-81,-83,-81,null,"QPSK 1/2",{"$f":"$H$55+'LINK BUDGET'!C37","v":-86},{"$f":"$H$55+'LINK BUDGET'!I37","v":-87}]
["QPSK 1/2 SS",-87,-84,-86,-84,null,"QPSK 1/2 SS",{"$f":"$H$55+'LINK BUDGET'!C38","v":-89},{"$f":"$H$55+'LINK BUDGET'!I38","v":-90}]
[]
["THROUGHPUT  ",null,null,null,null,null,"Interference (dBm)",{"$f":"'LINK BUDGET'!C17","v":0}]
["Modulation","DL","UL",null,null,null,"Interference (linear)",{"$f":"IF(H50=0,0,10^(H50/10))","v":0}]
["MCS15",43.2,30.4,null,null,null,"Noise floor (dBm)",{"$f":"-98+10*LOG('LINK BUDGET'!C8/20,10)","v":-98}]
["MCS14",37.799999999999997,26.200000000000003,null,null,null,"Noise floor (linear)",{"$f":"10^(H52/10)","v":1.5848931924611098E-10}]
["MCS13",34.200000000000003,24.2,null,null,null,"New noise floor (linear)",{"$f":"H51+H53","v":1.5848931924611098E-10}]
["MCS12",25.2,18.2,null,null,null,"New noise floor (dB)",{"$f":"10*LOG10(H54)","v":-98}]
["MCS11",16.200000000000003,12.2,null,null,null,"Delta noise floor (dB)",{"$f":"H52-H55","v":0}]
["MCS10",12.6,8]
["MCS9",9,6]
["MCS1",3.5999999999999996,2]

{"sheet":"Range","index":4,"n_rows":17,"n_cols":6,"rows_kept":17,"cut":false,"hidden":true,"merged":[]}
["Frequency (MHz)",{"$f":"'LINK BUDGET'!C6","v":"5.7/5.8"}]
["Max center freq (MHz)",{"$f":"Figures!B7","v":5865}]
["Fade Margin (dB)",{"$f":"'LINK BUDGET'!C7","v":0}]
["Environment",{"$f":"'LINK BUDGET'!C10","v":"rural"}]
[]
["Free space path loss","Gain","Rural","Suburban","Urban","Output"]
[null,"dB","Range (miles)","Range (miles)","Range (miles)","Range (miles)"]
["Exponent",null,2,2.5,3]
[]
["Gain MCS15 (dB)",{"$f":"'LINK BUDGET'!C53","v":115},{"$f":"10^((B10-(20*LOG($B$2))-36.6-$B$3)/(10*$C$8))","v":1.418182047915892},{"$f":"10^((B10-(20*LOG($B$2))-36.6-$B$3)/(10*$D$8))","v":1.3224692628240329},{"$f":"10^((B10-(20*LOG($B$2))-36.6-$B$3)/(10*$E$8))","v":1.2622769613704616},{"$f":"IF($B$4=\"rural\",C10,IF($B$4=\"suburban\",D10,E10))","v":1.418182047915892}]
["Gain MCS14 (dB)",{"$f":"'LINK BUDGET'!C54","v":117},{"$f":"10^((B11-(20*LOG($B$2))-36.6-$B$3)/(10*$C$8))","v":1.7853854186716098},{"$f":"10^((B11-(20*LOG($B$2))-36.6-$B$3)/(10*$D$8))","v":1.5899577605680426},{"$f":"10^((B11-(20*LOG($B$2))-36.6-$B$3)/(10*$E$8))","v":1.4717068875393393},{"$f":"IF($B$4=\"rural\",C11,IF($B$4=\"suburban\",D11,E11))","v":1.7853854186716098}]
["Gain MCS13 (dB)",{"$f":"'LINK BUDGET'!C55","v":120},2.5219239354956637,2.0959725318888767,1.8527691994357747,2.5219239354956637]
["Gain MCS12 (dB)",{"$f":"'LINK BUDGET'!C56","v":124},3.9969800772718185,3.02960205598322,2.5185736520759101,3.9969800772718185]
["Gain MCS11 (dB)",{"$f":"'LINK BUDGET'!C57","v":128},6.3347865148708005,4.3791073012517758,3.4236391898476577,6.3347865148708005]
["Gain MCS10 (dB)",{"$f":"'LINK BUDGET'!C58","v":130},7.9750237218618594,5.2648449636684509,3.9916702358870357,7.9750237218618594]
["Gain MCS9 (dB)",{"$f":"'LINK BUDGET'!C59","v":133},11.26502042638697,6.940417350810697,5.0252150954606067,11.26502042638697]
["Gain MCS8 (dB)",{"$f":"'LINK BUDGET'!C60","v":136},15.912264293213822,9.1492519411000082,6.326370983407009,15.912264293213822]

{"sheet":"Input","index":5,"n_rows":62,"n_cols":7,"rows_kept":62,"cut":false,"hidden":true,"merged":[]}
["Frame duration (msec)",{"$f":"'LINK BUDGET'!C13","v":5},"←◊"]
["TDD Ratio",{"$f":"'LINK BUDGET'!C15","v":"50/50"},"←◊"]
["Channel Bandwdith (MHz)",{"$f":"'LINK BUDGET'!C8","v":20},"←◊"]
["Cell Radius (miles)",{"$f":"'LINK BUDGET'!C11","v":5},"←◊"]
["Overall CPU PPF (Packet Per Frame) Limit ",{"$f":"VLOOKUP(B1,LookupTab!I27:K29,3,FALSE)","v":200},null,null,null,null," "]
["CPU PPF (Packet Per Frame) Limit (DL based on TDD Ratio)",{"$f":"ROUNDUP(VLOOKUP(B2,LookupTab!D10:G18,2,FALSE)*Input!B5,0)","v":100}]
["CPU PPF (Packet Per Frame) Limit (UL based on TDD Ratio)",{"$f":"B5-B6","v":100}]
["MAX_CONTROL_OH",0.15,"←◊"]
["DL Users Scheduled / frame",{"$f":"ROUNDDOWN(B8*B45/(B14+B28),0)","v":8}]
["UL Users Scheduled / frame",{"$f":"VLOOKUP(B2,LookupTab!M10:P18,IF(Input!B1=2.5,2,IF(Input!B1=5,3,4)),FALSE)","v":9}]
[]
["MCS","MCS1","←◊"]
[]
["Data Peamble Time (usec)",36]
["Control Preamble Time (usec)",32]
["Frames / Sec",{"$f":"1000/B1","v":200}]
["Ethernet Header (Bytes)",18]
["IP Header  (Bytes)",20]
["UDP Header  (Bytes)",8]
["UDP/IP/Ethernet Header length (Bytes)",{"$f":"SUM(B17:B19)","v":46}]
["UDP Payload Size (Bytes)",{"$f":"'LINK BUDGET'!C16","v":1472},"←◊"]
["Ethernet Packet Size (Bytes)",{"$f":"B21+B20","v":1518}]
["MAC MPDU Header Length (Bytes)",40]
["DL PHY/MAC/IP/TCP Overhead ",{"$f":"(B23+B20)/B21","v":5.8423913043478264E-2}]
[]
["STA's Time between consecutive MPDUs in A-MPDU (usec)",0]
["AP's Time between consecutive MPDUs in A-MPDU (usec)",0]
["DL Inter STA Transmission Time (usec)",8]
[]
["AP Jitter (Gated-Beacon Jitter) (usec) (Jap)",10]
["HW Transmission Delay (usec)",0,null,"Not Used compensated for in the \"AP Jitter\""]
["UL Inter STA Transmission Time (usec)",{"$f":"B30+B31","v":10}]
["Clock drift between GPS Synced APs in 1 PPS (usec) (SyncShift)",10]
["1PPS Stabilizer Error (Estab)",1.2]
[]
["Transmit to Receive switch time (usec) (ttr)",4]
["Receive to Transmit switch time (usec) (rtot)",4]
[]
["MAX MPDUs ACKed in ACK Cycle (3 frames) \n(for UL ACK STA --> AP)",{"$f":"3*B6","v":300}]
["MAC Management/Contol Header Size (Bytes)",28]
["UL ACK Frame Ies size (w/o ACK BITMAP) (Bytes)",9]
["ARQ ACK Frame Size Including MAC Header (STA --> AP) (Bytes) ",{"$f":"B40+B41+ROUNDUP(B39/8,0)","v":75}]
["ARQ ACK Frame Time (usec)",{"$f":"ROUND(B15+(B42*8/(IF(B3=20,52,108)))*4,0)","v":78}]
[]
["DL Useable duration (usec)",{"$f":"IF(B1=2.5,VLOOKUP(B2,LookupTab!D9:G18,3,FALSE),IF(B1=5,VLOOKUP(B2,LookupTab!D24:G33,3,FALSE),VLOOKUP(B2,LookupTab!D38:G47,3,FALSE)))","v":2463}]
["UL Useable duration (usec)",{"$f":"IF(B1=2.5,VLOOKUP(B2,LookupTab!D9:G18,4,FALSE),IF(B1=5,VLOOKUP(B2,LookupTab!D24:G33,4,FALSE),VLOOKUP(B2,LookupTab!D38:G47,4,FALSE)))","v":2409}]
["MCS (b/sym)",{"$f":"IF(B3=20,VLOOKUP(B12,LookupTab!I9:K22,2,FALSE),VLOOKUP(B12,LookupTab!I9:K22,3,FALSE))","v":52}]
["Max DL data/frame (KB)",{"$f":"($B$47/8) * ((B45-($B$14*B9))/4)/1024","v":3.4515380859375}]
["Max UL data/frame (KB)",{"$f":"($B$47/8) * ((B46-($B$14*B10))/4)/1024","v":3.3087158203125}]
[]
[]
["Roundtrip Delay (usec) (PD(cs))",{"$f":"2*B4*1000000 /186282.397","v":53.681937537018058}]
["TTRG (usec)",{"$f":"ROUNDUP(B30 + 2*B33+2*B34+B36+B52,0)","v":91}]
["RTTG (usec)",{"$f":"ROUNDUP(B30+2*B33+2*B34+B37,0)","v":37}]
[]
["Maximum Cell Size (miles)",{"$f":"IF(2*B4<10, 10, 40)","v":40}]
["PD(mcs)",{"$f":"B56*1000000 /186282.397","v":214.72775014807223}]
[]
["STA Jitter",12]
["UL IFS",8]
["INAR Duration + Preamble",72]
["CW duration (usec)",{"$f":"ROUNDUP(B59+B60+B61+2*B57-B52,0)","v":468}]

{"sheet":"UDP traffic","index":6,"n_rows":102,"n_cols":121,"rows_kept":102,"cut":false,"hidden":true,"merged":[[0,3,32,3]]}
["Frame duration (msec)",{"$f":"Input!B1","v":5},null,"Do not update …. Refer to \"Input\" Tab"]
["TDD Ratio",{"$f":"Input!B2","v":"50/50"}]
["CPU PPF (Packet Per Frame) Limit (DL based on TDD Ratio)",{"$f":"Input!B6","v":100}]
["CPU PPF (Packet Per Frame) Limit (UL based on TDD Ratio)",{"$f":"Input!B7","v":100}]
["DL Users Scheduled / frame",{"$f":"Input!B9","v":8}]
["UL Users Scheduled / frame",{"$f":"Input!B10","v":9}]
[]
["Peamble Time (usec)",{"$f":"Input!B14","v":36}]
["Frames / Sec",{"$f":"Input!B16","v":200}]
["Ethernet Header (Bytes)",{"$f":"Input!B17","v":18}]
["IP Header  (Bytes)",{"$f":"Input!B18","v":20}]
["UDP Header  (Bytes)",{"$f":"Input!B19","v":8}]
["UDP/IP/Ethernet Header length (Bytes)",{"$f":"Input!B20","v":46}]
["UDP Payload Size (Bytes)",{"$f":"Input!B21","v":1472}]
["MAC MPDU Header Length (Bytes)",{"$f":"Input!B23","v":40}]
["DL PHY/MAC/IP/TCP Overhead ",{"$f":"Input!B24","v":5.8423913043478264E-2}]
[]
["STA's Time between consecutive MPDUs in A-MPDU (usec)",{"$f":"Input!B26","v":0}]
["AP's Time between consecutive MPDUs in A-MPDU (usec)",{"$f":"Input!B27","v":0}]
["DL Inter STA Transmission Time (usec)",{"$f":"Input!B28","v":8}]
["UL Inter STA Transmission Time (usec)",{"$f":"Input!B32","v":10}]
[]
[]
["DL Useable duration (usec)",{"$f":"Input!B45","v":2463}]
["UL Useable duration (usec)",{"$f":"Input!B46","v":2409}]
["MCS (b/sym)",{"$f":"Input!B47","v":52}]
["Max DL data/frame (KB)",{"$f":"Input!B48","v":3.4515380859375}]
[]
["ARQ ACK (STA --> AP) Time (usec)",{"$f":"Input!B43 + B19","v":78}]
[]
[]
["Packet Transmission Time (usec)",{"$f":"(SUM(B13:B15)*8/B26)*4","v":958.76923076923072}]
["MAC MPDU Header Transmission time (usec)",{"$f":"ROUND(B15*8/B26*4,1)","v":24.6}]
[]
["Number STAs in the system",1,2,3,4,5,6,7,8,9,10,11,12,13,14,15,16,17,18,19,20,21,22,23,24,25,26,27,28,29,30,31,32,33,34,35,36,37,38,39,40,41,42,43,44,45,46,47,48,49,50,51,52,53,54,55,56,57,58,59,60,61,62,63,64,65,66,67,68,69,70,71,72,73,74,75,76,77,78,79,80,81,82,83,84,85,86,87,88,89,90,91,92,93,94,95,96,97,98,99,100,101,102,103,104,105,106,107,108,109,110,111,112,113,114,115,116,117,118,119,120]
["DL Active STAs (With Data to Transmit)",{"$f":"VLOOKUP(B35,'User Traffic Profile 1'!$A$9:$F$128,3,FALSE)","v":1},{"$f":"VLOOKUP(C35,'User Traffic Profile 1'!$A$9:$F$128,3,FALSE)","v":2},{"$f":"VLOOKUP(D35,'User Traffic Profile 1'!$A$9:$F$128,3,FALSE)","v":3},{"$f":"VLOOKUP(E35,'User Traffic Profile 1'!$A$9:$F$128,3,FALSE)","v":4},{"$f":"VLOOKUP(F35,'User Traffic Profile 1'!$A$9:$F$128,3,FALSE)","v":5},{"$f":"VLOOKUP(G35,'User Traffic Profile 1'!$A$9:$F$128,3,FALSE)","v":6},{"$f":"VLOOKUP(H35,'User Traffic Profile 1'!$A$9:$F$128,3,FALSE)","v":7},{"$f":"VLOOKUP(I35,'User Traffic Profile 1'!$A$9:$F$128,3,FALSE)","v":8},{"$f":"VLOOKUP(J35,'User Traffic Profile 1'!$A$9:$F$128,3,FALSE)","v":9},{"$f":"VLOOKUP(K35,'User Traffic Profile 1'!$A$9:$F$128,3,FALSE)","v":10},{"$f":"VLOOKUP(L35,'User Traffic Profile 1'!$A$9:$F$128,3,FALSE)","v":11},{"$f":"VLOOKUP(M35,'User Traffic Profile 1'!$A$9:$F$128,3,FALSE)","v":12},{"$f":"VLOOKUP(N35,'User Traffic Profile 1'!$A$9:$F$128,3,FALSE)","v":13},{"$f":"VLOOKUP(O35,'User Traffic Profile 1'!$A$9:$F$128,3,FALSE)","v":14},{"$f":"VLOOKUP(P35,'User Traffic Profile 1'!$A$9:$F$128,3,FALSE)","v":15},{"$f":"VLOOKUP(Q35,'User Traffic Profile 1'!$A$9:$F$128,3,FALSE)","v":16},{"$f":"VLOOKUP(R35,'User Traffic Profile 1'!$A$9:$F$128,3,FALSE)","v":17},{"$f":"VLOOKUP(S35,'User Traffic Profile 1'!$A$9:$F$128,3,FALSE)","v":18},{"$f":"VLOOKUP(T35,'User Traffic Profile 1'!$A$9:$F$128,3,FALSE)","v":19},{"$f":"VLOOKUP(U35,'User Traffic Profile 1'!$A$9:$F$128,3,FALSE)","v":20},{"$f":"VLOOKUP(V35,'User Traffic Profile 1'!$A$9:$F$128,3,FALSE)","v":21},{"$f":"VLOOKUP(W35,'User Traffic Profile 1'!$A$9:$F$128,3,FALSE)","v":22},{"$f":"VLOOKUP(X35,'User Traffic Profile 1'!$A$9:$F$128,3,FALSE)","v":23},{"$f":"VLOOKUP(Y35,'User Traffic Profile 1'!$A$9:$F$128,3,FALSE)","v":24},{"$f":"VLOOKUP(Z35,'User Traffic Profile 1'!$A$9:$F$128,3,FALSE)","v":25},{"$f":"VLOOKUP(AA35,'User Traffic Profile 1'!$A$9:$F$128,3,FALSE)","v":26},{"$f":"VLOOKUP(AB35,'User Traffic Profile 1'!$A$9:$F$128,3,FALSE)","v":27},{"$f":"VLOOKUP(AC35,'User Traffic Profile 1'!$A$9:$F$128,3,FALSE)","v":28},{"$f":"VLOOKUP(AD35,'User Traffic Profile 1'!$A$9:$F$128,3,FALSE)","v":29},{"$f":"VLOOKUP(AE35,'User Traffic Profile 1'!$A$9:$F$128,3,FALSE)","v":30},{"$f":"VLOOKUP(AF35,'User Traffic Profile 1'!$A$9:$F$128,3,FALSE)","v":31},{"$f":"VLOOKUP(AG35,'User Traffic Profile 1'!$A$9:$F$128,3,FALSE)","v":32},{"$f":"VLOOKUP(AH35,'User Traffic Profile 1'!$A$9:$F$128,3,FALSE)","v":33},{"$f":"VLOOKUP(AI35,'User Traffic Profile 1'!$A$9:$F$128,3,FALSE)","v":34},{"$f":"VLOOKUP(AJ35,'User Traffic Profile 1'!$A$9:$F$128,3,FALSE)","v":35},{"$f":"VLOOKUP(AK35,'User Traffic Profile 1'!$A$9:$F$128,3,FALSE)","v":36},{"$f":"VLOOKUP(AL35,'User Traffic Profile 1'!$A$9:$F$128,3,FALSE)","v":37},{"$f":"VLOOKUP(AM35,'User Traffic Profile 1'!$A$9:$F$128,3,FALSE)","v":38},{"$f":"VLOOKUP(AN35,'User Traffic Profile 1'!$A$9:$F$128,3,FALSE)","v":39},{"$f":"VLOOKUP(AO35,'User Traffic Profile 1'!$A$9:$F$128,3,FALSE)","v":40},{"$f":"VLOOKUP(AP35,'User Traffic Profile 1'!$A$9:$F$128,3,FALSE)","v":41},{"$f":"VLOOKUP(AQ35,'User Traffic Profile 1'!$A$9:$F$128,3,FALSE)","v":42},{"$f":"VLOOKUP(AR35,'User Traffic Profile 1'!$A$9:$F$128,3,FALSE)","v":43},{"$f":"VLOOKUP(AS35,'User Traffic Profile 1'!$A$9:$F$128,3,FALSE)","v":44},{"$f":"VLOOKUP(AT35,'User Traffic Profile 1'!$A$9:$F$128,3,FALSE)","v":45},{"$f":"VLOOKUP(AU35,'User Traffic Profile 1'!$A$9:$F$128,3,FALSE)","v":46},{"$f":"VLOOKUP(AV35,'User Traffic Profile 1'!$A$9:$F$128,3,FALSE)","v":47},{"$f":"VLOOKUP(AW35,'User Traffic Profile 1'!$A$9:$F$128,3,FALSE)","v":48},{"$f":"VLOOKUP(AX35,'User Traffic Profile 1'!$A$9:$F$128,3,FALSE)","v":49},{"$f":"VLOOKUP(AY35,'User Traffic Profile 1'!$A$9:$F$128,3,FALSE)","v":50},{"$f":"VLOOKUP(AZ35,'User Traffic Profile 1'!$A$9:$F$128,3,FALSE)","v":51},{"$f":"VLOOKUP(BA35,'User Traffic Profile 1'!$A$9:$F$128,3,FALSE)","v":52},{"$f":"VLOOKUP(BB35,'User Traffic Profile 1'!$A$9:$F$128,3,FALSE)","v":53},{"$f":"VLOOKUP(BC35,'User Traffic Profile 1'!$A$9:$F$128,3,FALSE)","v":54},{"$f":"VLOOKUP(BD35,'User Traffic Profile 1'!$A$9:$F$128,3,FALSE)","v":55},{"$f":"VLOOKUP(BE35,'User Traffic Profile 1'!$A$9:$F$128,3,FALSE)","v":56},{"$f":"VLOOKUP(BF35,'User Traffic Profile 1'!$A$9:$F$128,3,FALSE)","v":57},{"$f":"VLOOKUP(BG35,'User Traffic Profile 1'!$A$9:$F$128,3,FALSE)","v":58},{"$f":"VLOOKUP(BH35,'User Traffic Profile 1'!$A$9:$F$128,3,FALSE)","v":59},{"$f":"VLOOKUP(BI35,'User Traffic Profile 1'!$A$9:$F$128,3,FALSE)","v":60},{"$f":"VLOOKUP(BJ35,'User Traffic Profile 1'!$A$9:$F$128,3,FALSE)","v":61},{"$f":"VLOOKUP(BK35,'User Traffic Profile 1'!$A$9:$F$128,3,FALSE)","v":62},{"$f":"VLOOKUP(BL35,'User Traffic Profile 1'!$A$9:$F$128,3,FALSE)","v":63},{"$f":"VLOOKUP(BM35,'User Traffic Profile 1'!$A$9:$F$128,3,FALSE)","v":64},{"$f":"VLOOKUP(BN35,'User Traffic Profile 1'!$A$9:$F$128,3,FALSE)","v":65},{"$f":"VLOOKUP(BO35,'User Traffic Profile 1'!$A$9:$F$128,3,FALSE)","v":66},{"$f":"VLOOKUP(BP35,'User Traffic Profile 1'!$A$9:$F$128,3,FALSE)","v":67},{"$f":"VLOOKUP(BQ35,'User Traffic Profile 1'!$A$9:$F$128,3,FALSE)","v":68},{"$f":"VLOOKUP(BR35,'User Traffic Profile 1'!$A$9:$F$128,3,FALSE)","v":69},{"$f":"VLOOKUP(BS35,'User Traffic Profile 1'!$A$9:$F$128,3,FALSE)","v":70},{"$f":"VLOOKUP(BT35,'User Traffic Profile 1'!$A$9:$F$128,3,FALSE)","v":71},{"$f":"VLOOKUP(BU35,'User Traffic Profile 1'!$A$9:$F$128,3,FALSE)","v":72},{"$f":"VLOOKUP(BV35,'User Traffic Profile 1'!$A$9:$F$128,3,FALSE)","v":73},{"$f":"VLOOKUP(BW35,'User Traffic Profile 1'!$A$9:$F$128,3,FALSE)","v":74},{"$f":"VLOOKUP(BX35,'User Traffic Profile 1'!$A$9:$F$128,3,FALSE)","v":75},{"$f":"VLOOKUP(BY35,'User Traffic Profile 1'!$A$9:$F$128,3,FALSE)","v":76},{"$f":"VLOOKUP(BZ35,'User Traffic Profile 1'!$A$9:$F$128,3,FALSE)","v":77},{"$f":"VLOOKUP(CA35,'User Traffic Profile 1'!$A$9:$F$128,3,FALSE)","v":78},{"$f":"VLOOKUP(CB35,'User Traffic Profile 1'!$A$9:$F$128,3,FALSE)","v":79},{"$f":"VLOOKUP(CC35,'User Traffic Profile 1'!$A$9:$F$128,3,FALSE)","v":80},{"$f":"VLOOKUP(CD35,'User Traffic Profile 1'!$A$9:$F$128,3,FALSE)","v":81},{"$f":"VLOOKUP(CE35,'User Traffic Profile 1'!$A$9:$F$128,3,FALSE)","v":82},{"$f":"VLOOKUP(CF35,'User Traffic Profile 1'!$A$9:$F$128,3,FALSE)","v":83},{"$f":"VLOOKUP(CG35,'User Traffic Profile 1'!$A$9:$F$128,3,FALSE)","v":84},{"$f":"VLOOKUP(CH35,'User Traffic Profile 1'!$A$9:$F$128,3,FALSE)","v":85},{"$f":"VLOOKUP(CI35,'User Traffic Profile 1'!$A$9:$F$128,3,FALSE)","v":86},{"$f":"VLOOKUP(CJ35,'User Traffic Profile 1'!$A$9:$F$128,3,FALSE)","v":87},{"$f":"VLOOKUP(CK35,'User Traffic Profile 1'!$A$9:$F$128,3,FALSE)","v":88},{"$f":"VLOOKUP(CL35,'User Traffic Profile 1'!$A$9:$F$128,3,FALSE)","v":89},{"$f":"VLOOKUP(CM35,'User Traffic Profile 1'!$A$9:$F$128,3,FALSE)","v":90},{"$f":"VLOOKUP(CN35,'User Traffic Profile 1'!$A$9:$F$128,3,FALSE)","v":91},{"$f":"VLOOKUP(CO35,'User Traffic Profile 1'!$A$9:$F$128,3,FALSE)","v":92},{"$f":"VLOOKUP(CP35,'User Traffic Profile 1'!$A$9:$F$128,3,FALSE)","v":93},{"$f":"VLOOKUP(CQ35,'User Traffic Profile 1'!$A$9:$F$128,3,FALSE)","v":94},{"$f":"VLOOKUP(CR35,'User Traffic Profile 1'!$A$9:$F$128,3,FALSE)","v":95},{"$f":"VLOOKUP(CS35,'User Traffic Profile 1'!$A$9:$F$128,3,FALSE)","v":96},{"$f":"VLOOKUP(CT35,'User Traffic Profile 1'!$A$9:$F$128,3,FALSE)","v":97},{"$f":"VLOOKUP(CU35,'User Traffic Profile 1'!$A$9:$F$128,3,FALSE)","v":98},{"$f":"VLOOKUP(CV35,'User Traffic Profile 1'!$A$9:$F$128,3,FALSE)","v":99},{"$f":"VLOOKUP(CW35,'User Traffic Profile 1'!$A$9:$F$128,3,FALSE)","v":100},{"$f":"VLOOKUP(CX35,'User Traffic Profile 1'!$A$9:$F$128,3,FALSE)","v":101},{"$f":"VLOOKUP(CY35,'User Traffic Profile 1'!$A$9:$F$128,3,FALSE)","v":102},{"$f":"VLOOKUP(CZ35,'User Traffic Profile 1'!$A$9:$F$128,3,FALSE)","v":103},{"$f":"VLOOKUP(DA35,'User Traffic Profile 1'!$A$9:$F$128,3,FALSE)","v":104},{"$f":"VLOOKUP(DB35,'User Traffic Profile 1'!$A$9:$F$128,3,FALSE)","v":105},{"$f":"VLOOKUP(DC35,'User Traffic Profile 1'!$A$9:$F$128,3,FALSE)","v":106},{"$f":"VLOOKUP(DD35,'User Traffic Profile 1'!$A$9:$F$128,3,FALSE)","v":107},{"$f":"VLOOKUP(DE35,'User Traffic Profile 1'!$A$9:$F$128,3,FALSE)","v":108},{"$f":"VLOOKUP(DF35,'User Traffic Profile 1'!$A$9:$F$128,3,FALSE)","v":109},{"$f":"VLOOKUP(DG35,'User Traffic Profile 1'!$A$9:$F$128,3,FALSE)","v":110},{"$f":"VLOOKUP(DH35,'User Traffic Profile 1'!$A$9:$F$128,3,FALSE)","v":111},{"$f":"VLOOKUP(DI35,'User Traffic Profile 1'!$A$9:$F$128,3,FALSE)","v":112},{"$f":"VLOOKUP(DJ35,'User Traffic Profile 1'!$A$9:$F$128,3,FALSE)","v":113},{"$f":"VLOOKUP(DK35,'User Traffic Profile 1'!$A$9:$F$128,3,FALSE)","v":114},{"$f":"VLOOKUP(DL35,'User Traffic Profile 1'!$A$9:$F$128,3,FALSE)","v":115},{"$f":"VLOOKUP(DM35,'User Traffic Profile 1'!$A$9:$F$128,3,FALSE)","v":116},{"$f":"VLOOKUP(DN35,'User Traffic Profile 1'!$A$9:$F$128,3,FALSE)","v":117},{"$f":"VLOOKUP(DO35,'User Traffic Profile 1'!$A$9:$F$128,3,FALSE)","v":118},{"$f":"VLOOKUP(DP35,'User Traffic Profile 1'!$A$9:$F$128,3,FALSE)","v":119},{"$f":"VLOOKUP(DQ35,'User Traffic Profile 1'!$A$9:$F$128,3,FALSE)","v":120}]
["UL Active STAs (With Data to Transmit)",{"$f":"VLOOKUP(B35,'User Traffic Profile 1'!$A$9:$F$128,5,FALSE)","v":1},{"$f":"VLOOKUP(C35,'User Traffic Profile 1'!$A$9:$F$128,5,FALSE)","v":2},{"$f":"VLOOKUP(D35,'User Traffic Profile 1'!$A$9:$F$128,5,FALSE)","v":3},{"$f":"VLOOKUP(E35,'User Traffic Profile 1'!$A$9:$F$128,5,FALSE)","v":4},{"$f":"VLOOKUP(F35,'User Traffic Profile 1'!$A$9:$F$128,5,FALSE)","v":5},{"$f":"VLOOKUP(G35,'User Traffic Profile 1'!$A$9:$F$128,5,FALSE)","v":6},{"$f":"VLOOKUP(H35,'User Traffic Profile 1'!$A$9:$F$128,5,FALSE)","v":7},{"$f":"VLOOKUP(I35,'User Traffic Profile 1'!$A$9:$F$128,5,FALSE)","v":8},{"$f":"VLOOKUP(J35,'User Traffic Profile 1'!$A$9:$F$128,5,FALSE)","v":9},{"$f":"VLOOKUP(K35,'User Traffic Profile 1'!$A$9:$F$128,5,FALSE)","v":10},{"$f":"VLOOKUP(L35,'User Traffic Profile 1'!$A$9:$F$128,5,FALSE)","v":11},{"$f":"VLOOKUP(M35,'User Traffic Profile 1'!$A$9:$F$128,5,FALSE)","v":12},{"$f":"VLOOKUP(N35,'User Traffic Profile 1'!$A$9:$F$128,5,FALSE)","v":13},{"$f":"VLOOKUP(O35,'User Traffic Profile 1'!$A$9:$F$128,5,FALSE)","v":14},{"$f":"VLOOKUP(P35,'User Traffic Profile 1'!$A$9:$F$128,5,FALSE)","v":15},{"$f":"VLOOKUP(Q35,'User Traffic Profile 1'!$A$9:$F$128,5,FALSE)","v":16},{"$f":"VLOOKUP(R35,'User Traffic Profile 1'!$A$9:$F$128,5,FALSE)","v":17},{"$f":"VLOOKUP(S35,'User Traffic Profile 1'!$A$9:$F$128,5,FALSE)","v":18},{"$f":"VLOOKUP(T35,'User Traffic Profile 1'!$A$9:$F$128,5,FALSE)","v":19},{"$f":"VLOOKUP(U35,'User Traffic Profile 1'!$A$9:$F$128,5,FALSE)","v":20},{"$f":"VLOOKUP(V35,'User Traffic Profile 1'!$A$9:$F$128,5,FALSE)","v":21},{"$f":"VLOOKUP(W35,'User Traffic Profile 1'!$A$9:$F$128,5,FALSE)","v":22},{"$f":"VLOOKUP(X35,'User Traffic Profile 1'!$A$9:$F$128,5,FALSE)","v":23},{"$f":"VLOOKUP(Y35,'User Traffic Profile 1'!$A$9:$F$128,5,FALSE)","v":24},{"$f":"VLOOKUP(Z35,'User Traffic Profile 1'!$A$9:$F$128,5,FALSE)","v":25},{"$f":"VLOOKUP(AA35,'User Traffic Profile 1'!$A$9:$F$128,5,FALSE)","v":26},{"$f":"VLOOKUP(AB35,'User Traffic Profile 1'!$A$9:$F$128,5,FALSE)","v":27},{"$f":"VLOOKUP(AC35,'User Traffic Profile 1'!$A$9:$F$128,5,FALSE)","v":28},{"$f":"VLOOKUP(AD35,'User Traffic Profile 1'!$A$9:$F$128,5,FALSE)","v":29},{"$f":"VLOOKUP(AE35,'User Traffic Profile 1'!$A$9:$F$128,5,FALSE)","v":30},{"$f":"VLOOKUP(AF35,'User Traffic Profile 1'!$A$9:$F$128,5,FALSE)","v":31},{"$f":"VLOOKUP(AG35,'User Traffic Profile 1'!$A$9:$F$128,5,FALSE)","v":32},{"$f":"VLOOKUP(AH35,'User Traffic Profile 1'!$A$9:$F$128,5,FALSE)","v":33},{"$f":"VLOOKUP(AI35,'User Traffic Profile 1'!$A$9:$F$128,5,FALSE)","v":34},{"$f":"VLOOKUP(AJ35,'User Traffic Profile 1'!$A$9:$F$128,5,FALSE)","v":35},{"$f":"VLOOKUP(AK35,'User Traffic Profile 1'!$A$9:$F$128,5,FALSE)","v":36},{"$f":"VLOOKUP(AL35,'User Traffic Profile 1'!$A$9:$F$128,5,FALSE)","v":37},{"$f":"VLOOKUP(AM35,'User Traffic Profile 1'!$A$9:$F$128,5,FALSE)","v":38},{"$f":"VLOOKUP(AN35,'User Traffic Profile 1'!$A$9:$F$128,5,FALSE)","v":39},{"$f":"VLOOKUP(AO35,'User Traffic Profile 1'!$A$9:$F$128,5,FALSE)","v":40},{"$f":"VLOOKUP(AP35,'User Traffic Profile 1'!$A$9:$F$128,5,FALSE)","v":41},{"$f":"VLOOKUP(AQ35,'User Traffic Profile 1'!$A$9:$F$128,5,FALSE)","v":42},{"$f":"VLOOKUP(AR35,'User Traffic Profile 1'!$A$9:$F$128,5,FALSE)","v":43},{"$f":"VLOOKUP(AS35,'User Traffic Profile 1'!$A$9:$F$128,5,FALSE)","v":44},{"$f":"VLOOKUP(AT35,'User Traffic Profile 1'!$A$9:$F$128,5,FALSE)","v":45},{"$f":"VLOOKUP(AU35,'User Traffic Profile 1'!$A$9:$F$128,5,FALSE)","v":46},{"$f":"VLOOKUP(AV35,'User Traffic Profile 1'!$A$9:$F$128,5,FALSE)","v":47},{"$f":"VLOOKUP(AW35,'User Traffic Profile 1'!$A$9:$F$128,5,FALSE)","v":48},{"$f":"VLOOKUP(AX35,'User Traffic Profile 1'!$A$9:$F$128,5,FALSE)","v":49},{"$f":"VLOOKUP(AY35,'User Traffic Profile 1'!$A$9:$F$128,5,FALSE)","v":50},{"$f":"VLOOKUP(AZ35,'User Traffic Profile 1'!$A$9:$F$128,5,FALSE)","v":51},{"$f":"VLOOKUP(BA35,'User Traffic Profile 1'!$A$9:$F$128,5,FALSE)","v":52},{"$f":"VLOOKUP(BB35,'User Traffic Profile 1'!$A$9:$F$128,5,FALSE)","v":53},{"$f":"VLOOKUP(BC35,'User Traffic Profile 1'!$A$9:$F$128,5,FALSE)","v":54},{"$f":"VLOOKUP(BD35,'User Traffic Profile 1'!$A$9:$F$128,5,FALSE)","v":55},{"$f":"VLOOKUP(BE35,'User Traffic Profile 1'!$A$9:$F$128,5,FALSE)","v":56},{"$f":"VLOOKUP(BF35,'User Traffic Profile 1'!$A$9:$F$128,5,FALSE)","v":57},{"$f":"VLOOKUP(BG35,'User Traffic Profile 1'!$A$9:$F$128,5,FALSE)","v":58},{"$f":"VLOOKUP(BH35,'User Traffic Profile 1'!$A$9:$F$128,5,FALSE)","v":59},{"$f":"VLOOKUP(BI35,'User Traffic Profile 1'!$A$9:$F$128,5,FALSE)","v":60},{"$f":"VLOOKUP(BJ35,'User Traffic Profile 1'!$A$9:$F$128,5,FALSE)","v":61},{"$f":"VLOOKUP(BK35,'User Traffic Profile 1'!$A$9:$F$128,5,FALSE)","v":62},{"$f":"VLOOKUP(BL35,'User Traffic Profile 1'!$A$9:$F$128,5,FALSE)","v":63},{"$f":"VLOOKUP(BM35,'User Traffic Profile 1'!$A$9:$F$128,5,FALSE)","v":64},{"$f":"VLOOKUP(BN35,'User Traffic Profile 1'!$A$9:$F$128,5,FALSE)","v":65},{"$f":"VLOOKUP(BO35,'User Traffic Profile 1'!$A$9:$F$128,5,FALSE)","v":66},{"$f":"VLOOKUP(BP35,'User Traffic Profile 1'!$A$9:$F$128,5,FALSE)","v":67},{"$f":"VLOOKUP(BQ35,'User Traffic Profile 1'!$A$9:$F$128,5,FALSE)","v":68},{"$f":"VLOOKUP(BR35,'User Traffic Profile 1'!$A$9:$F$128,5,FALSE)","v":69},{"$f":"VLOOKUP(BS35,'User Traffic Profile 1'!$A$9:$F$128,5,FALSE)","v":70},{"$f":"VLOOKUP(BT35,'User Traffic Profile 1'!$A$9:$F$128,5,FALSE)","v":71},{"$f":"VLOOKUP(BU35,'User Traffic Profile 1'!$A$9:$F$128,5,FALSE)","v":72},{"$f":"VLOOKUP(BV35,'User Traffic Profile 1'!$A$9:$F$128,5,FALSE)","v":73},{"$f":"VLOOKUP(BW35,'User Traffic Profile 1'!$A$9:$F$128,5,FALSE)","v":74},{"$f":"VLOOKUP(BX35,'User Traffic Profile 1'!$A$9:$F$128,5,FALSE)","v":75},{"$f":"VLOOKUP(BY35,'User Traffic Profile 1'!$A$9:$F$128,5,FALSE)","v":76},{"$f":"VLOOKUP(BZ35,'User Traffic Profile 1'!$A$9:$F$128,5,FALSE)","v":77},{"$f":"VLOOKUP(CA35,'User Traffic Profile 1'!$A$9:$F$128,5,FALSE)","v":78},{"$f":"VLOOKUP(CB35,'User Traffic Profile 1'!$A$9:$F$128,5,FALSE)","v":79},{"$f":"VLOOKUP(CC35,'User Traffic Profile 1'!$A$9:$F$128,5,FALSE)","v":80},{"$f":"VLOOKUP(CD35,'User Traffic Profile 1'!$A$9:$F$128,5,FALSE)","v":81},{"$f":"VLOOKUP(CE35,'User Traffic Profile 1'!$A$9:$F$128,5,FALSE)","v":82},{"$f":"VLOOKUP(CF35,'User Traffic Profile 1'!$A$9:$F$128,5,FALSE)","v":83},{"$f":"VLOOKUP(CG35,'User Traffic Profile 1'!$A$9:$F$128,5,FALSE)","v":84},{"$f":"VLOOKUP(CH35,'User Traffic Profile 1'!$A$9:$F$128,5,FALSE)","v":85},{"$f":"VLOOKUP(CI35,'User Traffic Profile 1'!$A$9:$F$128,5,FALSE)","v":86},{"$f":"VLOOKUP(CJ35,'User Traffic Profile 1'!$A$9:$F$128,5,FALSE)","v":87},{"$f":"VLOOKUP(CK35,'User Traffic Profile 1'!$A$9:$F$128,5,FALSE)","v":88},{"$f":"VLOOKUP(CL35,'User Traffic Profile 1'!$A$9:$F$128,5,FALSE)","v":89},{"$f":"VLOOKUP(CM35,'User Traffic Profile 1'!$A$9:$F$128,5,FALSE)","v":90},{"$f":"VLOOKUP(CN35,'User Traffic Profile 1'!$A$9:$F$128,5,FALSE)","v":91},{"$f":"VLOOKUP(CO35,'User Traffic Profile 1'!$A$9:$F$128,5,FALSE)","v":92},{"$f":"VLOOKUP(CP35,'User Traffic Profile 1'!$A$9:$F$128,5,FALSE)","v":93},{"$f":"VLOOKUP(CQ35,'User Traffic Profile 1'!$A$9:$F$128,5,FALSE)","v":94},{"$f":"VLOOKUP(CR35,'User Traffic Profile 1'!$A$9:$F$128,5,FALSE)","v":95},{"$f":"VLOOKUP(CS35,'User Traffic Profile 1'!$A$9:$F$128,5,FALSE)","v":96},{"$f":"VLOOKUP(CT35,'User Traffic Profile 1'!$A$9:$F$128,5,FALSE)","v":97},{"$f":"VLOOKUP(CU35,'User Traffic Profile 1'!$A$9:$F$128,5,FALSE)","v":98},{"$f":"VLOOKUP(CV35,'User Traffic Profile 1'!$A$9:$F$128,5,FALSE)","v":99},{"$f":"VLOOKUP(CW35,'User Traffic Profile 1'!$A$9:$F$128,5,FALSE)","v":100},{"$f":"VLOOKUP(CX35,'User Traffic Profile 1'!$A$9:$F$128,5,FALSE)","v":101},{"$f":"VLOOKUP(CY35,'User Traffic Profile 1'!$A$9:$F$128,5,FALSE)","v":102},{"$f":"VLOOKUP(CZ35,'User Traffic Profile 1'!$A$9:$F$128,5,FALSE)","v":103},{"$f":"VLOOKUP(DA35,'User Traffic Profile 1'!$A$9:$F$128,5,FALSE)","v":104},{"$f":"VLOOKUP(DB35,'User Traffic Profile 1'!$A$9:$F$128,5,FALSE)","v":105},{"$f":"VLOOKUP(DC35,'User Traffic Profile 1'!$A$9:$F$128,5,FALSE)","v":106},{"$f":"VLOOKUP(DD35,'User Traffic Profile 1'!$A$9:$F$128,5,FALSE)","v":107},{"$f":"VLOOKUP(DE35,'User Traffic Profile 1'!$A$9:$F$128,5,FALSE)","v":108},{"$f":"VLOOKUP(DF35,'User Traffic Profile 1'!$A$9:$F$128,5,FALSE)","v":109},{"$f":"VLOOKUP(DG35,'User Traffic Profile 1'!$A$9:$F$128,5,FALSE)","v":110},{"$f":"VLOOKUP(DH35,'User Traffic Profile 1'!$A$9:$F$128,5,FALSE)","v":111},{"$f":"VLOOKUP(DI35,'User Traffic Profile 1'!$A$9:$F$128,5,FALSE)","v":112},{"$f":"VLOOKUP(DJ35,'User Traffic Profile 1'!$A$9:$F$128,5,FALSE)","v":113},{"$f":"VLOOKUP(DK35,'User Traffic Profile 1'!$A$9:$F$128,5,FALSE)","v":114},{"$f":"VLOOKUP(DL35,'User Traffic Profile 1'!$A$9:$F$128,5,FALSE)","v":115},{"$f":"VLOOKUP(DM35,'User Traffic Profile 1'!$A$9:$F$128,5,FALSE)","v":116},{"$f":"VLOOKUP(DN35,'User Traffic Profile 1'!$A$9:$F$128,5,FALSE)","v":117},{"$f":"VLOOKUP(DO35,'User Traffic Profile 1'!$A$9:$F$128,5,FALSE)","v":118},{"$f":"VLOOKUP(DP35,'User Traffic Profile 1'!$A$9:$F$128,5,FALSE)","v":119},{"$f":"VLOOKUP(DQ35,'User Traffic Profile 1'!$A$9:$F$128,5,FALSE)","v":120}]
["UL Idle STAs (To Be Polled)",{"$f":"VLOOKUP(B35,'User Traffic Profile 1'!$A$9:$F$128,6,FALSE)","v":0},{"$f":"VLOOKUP(C35,'User Traffic Profile 1'!$A$9:$F$128,6,FALSE)","v":0},{"$f":"VLOOKUP(D35,'User Traffic Profile 1'!$A$9:$F$128,6,FALSE)","v":0},{"$f":"VLOOKUP(E35,'User Traffic Profile 1'!$A$9:$F$128,6,FALSE)","v":0},{"$f":"VLOOKUP(F35,'User Traffic Profile 1'!$A$9:$F$128,6,FALSE)","v":0},{"$f":"VLOOKUP(G35,'User Traffic Profile 1'!$A$9:$F$128,6,FALSE)","v":0},{"$f":"VLOOKUP(H35,'User Traffic Profile 1'!$A$9:$F$128,6,FALSE)","v":0},{"$f":"VLOOKUP(I35,'User Traffic Profile 1'!$A$9:$F$128,6,FALSE)","v":0},{"$f":"VLOOKUP(J35,'User Traffic Profile 1'!$A$9:$F$128,6,FALSE)","v":0},{"$f":"VLOOKUP(K35,'User Traffic Profile 1'!$A$9:$F$128,6,FALSE)","v":0},{"$f":"VLOOKUP(L35,'User Traffic Profile 1'!$A$9:$F$128,6,FALSE)","v":0},{"$f":"VLOOKUP(M35,'User Traffic Profile 1'!$A$9:$F$128,6,FALSE)","v":0},{"$f":"VLOOKUP(N35,'User Traffic Profile 1'!$A$9:$F$128,6,FALSE)","v":0},{"$f":"VLOOKUP(O35,'User Traffic Profile 1'!$A$9:$F$128,6,FALSE)","v":0},{"$f":"VLOOKUP(P35,'User Traffic Profile 1'!$A$9:$F$128,6,FALSE)","v":0},{"$f":"VLOOKUP(Q35,'User Traffic Profile 1'!$A$9:$F$128,6,FALSE)","v":0},{"$f":"VLOOKUP(R35,'User Traffic Profile 1'!$A$9:$F$128,6,FALSE)","v":0},{"$f":"VLOOKUP(S35,'User Traffic Profile 1'!$A$9:$F$128,6,FALSE)","v":0},{"$f":"VLOOKUP(T35,'User Traffic Profile 1'!$A$9:$F$128,6,FALSE)","v":0},{"$f":"VLOOKUP(U35,'User Traffic Profile 1'!$A$9:$F$128,6,FALSE)","v":0},{"$f":"VLOOKUP(V35,'User Traffic Profile 1'!$A$9:$F$128,6,FALSE)","v":0},{"$f":"VLOOKUP(W35,'User Traffic Profile 1'!$A$9:$F$128,6,FALSE)","v":0},{"$f":"VLOOKUP(X35,'User Traffic Profile 1'!$A$9:$F$128,6,FALSE)","v":0},{"$f":"VLOOKUP(Y35,'User Traffic Profile 1'!$A$9:$F$128,6,FALSE)","v":0},{"$f":"VLOOKUP(Z35,'User Traffic Profile 1'!$A$9:$F$128,6,FALSE)","v":0},{"$f":"VLOOKUP(AA35,'User Traffic Profile 1'!$A$9:$F$128,6,FALSE)","v":0},{"$f":"VLOOKUP(AB35,'User Traffic Profile 1'!$A$9:$F$128,6,FALSE)","v":0},{"$f":"VLOOKUP(AC35,'User Traffic Profile 1'!$A$9:$F$128,6,FALSE)","v":0},{"$f":"VLOOKUP(AD35,'User Traffic Profile 1'!$A$9:$F$128,6,FALSE)","v":0},{"$f":"VLOOKUP(AE35,'User Traffic Profile 1'!$A$9:$F$128,6,FALSE)","v":0},{"$f":"VLOOKUP(AF35,'User Traffic Profile 1'!$A$9:$F$128,6,FALSE)","v":0},{"$f":"VLOOKUP(AG35,'User Traffic Profile 1'!$A$9:$F$128,6,FALSE)","v":0},{"$f":"VLOOKUP(AH35,'User Traffic Profile 1'!$A$9:$F$128,6,FALSE)","v":0},{"$f":"VLOOKUP(AI35,'User Traffic Profile 1'!$A$9:$F$128,6,FALSE)","v":0},{"$f":"VLOOKUP(AJ35,'User Traffic Profile 1'!$A$9:$F$128,6,FALSE)","v":0},{"$f":"VLOOKUP(AK35,'User Traffic Profile 1'!$A$9:$F$128,6,FALSE)","v":0},{"$f":"VLOOKUP(AL35,'User Traffic Profile 1'!$A$9:$F$128,6,FALSE)","v":0},{"$f":"VLOOKUP(AM35,'User Traffic Profile 1'!$A$9:$F$128,6,FALSE)","v":0},{"$f":"VLOOKUP(AN35,'User Traffic Profile 1'!$A$9:$F$128,6,FALSE)","v":0},{"$f":"VLOOKUP(AO35,'User Traffic Profile 1'!$A$9:$F$128,6,FALSE)","v":0},{"$f":"VLOOKUP(AP35,'User Traffic Profile 1'!$A$9:$F$128,6,FALSE)","v":0},{"$f":"VLOOKUP(AQ35,'User Traffic Profile 1'!$A$9:$F$128,6,FALSE)","v":0},{"$f":"VLOOKUP(AR35,'User Traffic Profile 1'!$A$9:$F$128,6,FALSE)","v":0},{"$f":"VLOOKUP(AS35,'User Traffic Profile 1'!$A$9:$F$128,6,FALSE)","v":0},{"$f":"VLOOKUP(AT35,'User Traffic Profile 1'!$A$9:$F$128,6,FALSE)","v":0},{"$f":"VLOOKUP(AU35,'User Traffic Profile 1'!$A$9:$F$128,6,FALSE)","v":0},{"$f":"VLOOKUP(AV35,'User Traffic Profile 1'!$A$9:$F$128,6,FALSE)","v":0},{"$f":"VLOOKUP(AW35,'User Traffic Profile 1'!$A$9:$F$128,6,FALSE)","v":0},{"$f":"VLOOKUP(AX35,'User Traffic Profile 1'!$A$9:$F$128,6,FALSE)","v":0},{"$f":"VLOOKUP(AY35,'User Traffic Profile 1'!$A$9:$F$128,6,FALSE)","v":0},{"$f":"VLOOKUP(AZ35,'User Traffic Profile 1'!$A$9:$F$128,6,FALSE)","v":0},{"$f":"VLOOKUP(BA35,'User Traffic Profile 1'!$A$9:$F$128,6,FALSE)","v":0},{"$f":"VLOOKUP(BB35,'User Traffic Profile 1'!$A$9:$F$128,6,FALSE)","v":0},{"$f":"VLOOKUP(BC35,'User Traffic Profile 1'!$A$9:$F$128,6,FALSE)","v":0},{"$f":"VLOOKUP(BD35,'User Traffic Profile 1'!$A$9:$F$128,6,FALSE)","v":0},{"$f":"VLOOKUP(BE35,'User Traffic Profile 1'!$A$9:$F$128,6,FALSE)","v":0},{"$f":"VLOOKUP(BF35,'User Traffic Profile 1'!$A$9:$F$128,6,FALSE)","v":0},{"$f":"VLOOKUP(BG35,'User Traffic Profile 1'!$A$9:$F$128,6,FALSE)","v":0},{"$f":"VLOOKUP(BH35,'User Traffic Profile 1'!$A$9:$F$128,6,FALSE)","v":0},{"$f":"VLOOKUP(BI35,'User Traffic Profile 1'!$A$9:$F$128,6,FALSE)","v":0},{"$f":"VLOOKUP(BJ35,'User Traffic Profile 1'!$A$9:$F$128,6,FALSE)","v":0},{"$f":"VLOOKUP(BK35,'User Traffic Profile 1'!$A$9:$F$128,6,FALSE)","v":0},{"$f":"VLOOKUP(BL35,'User Traffic Profile 1'!$A$9:$F$128,6,FALSE)","v":0},{"$f":"VLOOKUP(BM35,'User Traffic Profile 1'!$A$9:$F$128,6,FALSE)","v":0},{"$f":"VLOOKUP(BN35,'User Traffic Profile 1'!$A$9:$F$128,6,FALSE)","v":0},{"$f":"VLOOKUP(BO35,'User Traffic Profile 1'!$A$9:$F$128,6,FALSE)","v":0},{"$f":"VLOOKUP(BP35,'User Traffic Profile 1'!$A$9:$F$128,6,FALSE)","v":0},{"$f":"VLOOKUP(BQ35,'User Traffic Profile 1'!$A$9:$F$128,6,FALSE)","v":0},{"$f":"VLOOKUP(BR35,'User Traffic Profile 1'!$A$9:$F$128,6,FALSE)","v":0},{"$f":"VLOOKUP(BS35,'User Traffic Profile 1'!$A$9:$F$128,6,FALSE)","v":0},{"$f":"VLOOKUP(BT35,'User Traffic Profile 1'!$A$9:$F$128,6,FALSE)","v":0},{"$f":"VLOOKUP(BU35,'User Traffic Profile 1'!$A$9:$F$128,6,FALSE)","v":0},{"$f":"VLOOKUP(BV35,'User Traffic Profile 1'!$A$9:$F$128,6,FALSE)","v":0},{"$f":"VLOOKUP(BW35,'User Traffic Profile 1'!$A$9:$F$128,6,FALSE)","v":0},{"$f":"VLOOKUP(BX35,'User Traffic Profile 1'!$A$9:$F$128,6,FALSE)","v":0},{"$f":"VLOOKUP(BY35,'User Traffic Profile 1'!$A$9:$F$128,6,FALSE)","v":0},{"$f":"VLOOKUP(BZ35,'User Traffic Profile 1'!$A$9:$F$128,6,FALSE)","v":0},{"$f":"VLOOKUP(CA35,'User Traffic Profile 1'!$A$9:$F$128,6,FALSE)","v":0},{"$f":"VLOOKUP(CB35,'User Traffic Profile 1'!$A$9:$F$128,6,FALSE)","v":0},{"$f":"VLOOKUP(CC35,'User Traffic Profile 1'!$A$9:$F$128,6,FALSE)","v":0},{"$f":"VLOOKUP(CD35,'User Traffic Profile 1'!$A$9:$F$128,6,FALSE)","v":0},{"$f":"VLOOKUP(CE35,'User Traffic Profile 1'!$A$9:$F$128,6,FALSE)","v":0},{"$f":"VLOOKUP(CF35,'User Traffic Profile 1'!$A$9:$F$128,6,FALSE)","v":0},{"$f":"VLOOKUP(CG35,'User Traffic Profile 1'!$A$9:$F$128,6,FALSE)","v":0},{"$f":"VLOOKUP(CH35,'User Traffic Profile 1'!$A$9:$F$128,6,FALSE)","v":0},{"$f":"VLOOKUP(CI35,'User Traffic Profile 1'!$A$9:$F$128,6,FALSE)","v":0},{"$f":"VLOOKUP(CJ35,'User Traffic Profile 1'!$A$9:$F$128,6,FALSE)","v":0},{"$f":"VLOOKUP(CK35,'User Traffic Profile 1'!$A$9:$F$128,6,FALSE)","v":0},{"$f":"VLOOKUP(CL35,'User Traffic Profile 1'!$A$9:$F$128,6,FALSE)","v":0},{"$f":"VLOOKUP(CM35,'User Traffic Profile 1'!$A$9:$F$128,6,FALSE)","v":0},{"$f":"VLOOKUP(CN35,'User Traffic Profile 1'!$A$9:$F$128,6,FALSE)","v":0},{"$f":"VLOOKUP(CO35,'User Traffic Profile 1'!$A$9:$F$128,6,FALSE)","v":0},{"$f":"VLOOKUP(CP35,'User Traffic Profile 1'!$A$9:$F$128,6,FALSE)","v":0},{"$f":"VLOOKUP(CQ35,'User Traffic Profile 1'!$A$9:$F$128,6,FALSE)","v":0},{"$f":"VLOOKUP(CR35,'User Traffic Profile 1'!$A$9:$F$128,6,FALSE)","v":0},{"$f":"VLOOKUP(CS35,'User Traffic Profile 1'!$A$9:$F$128,6,FALSE)","v":0},{"$f":"VLOOKUP(CT35,'User Traffic Profile 1'!$A$9:$F$128,6,FALSE)","v":0},{"$f":"VLOOKUP(CU35,'User Traffic Profile 1'!$A$9:$F$128,6,FALSE)","v":0},{"$f":"VLOOKUP(CV35,'User Traffic Profile 1'!$A$9:$F$128,6,FALSE)","v":0},{"$f":"VLOOKUP(CW35,'User Traffic Profile 1'!$A$9:$F$128,6,FALSE)","v":0},{"$f":"VLOOKUP(CX35,'User Traffic Profile 1'!$A$9:$F$128,6,FALSE)","v":0},{"$f":"VLOOKUP(CY35,'User Traffic Profile 1'!$A$9:$F$128,6,FALSE)","v":0},{"$f":"VLOOKUP(CZ35,'User Traffic Profile 1'!$A$9:$F$128,6,FALSE)","v":0},{"$f":"VLOOKUP(DA35,'User Traffic Profile 1'!$A$9:$F$128,6,FALSE)","v":0},{"$f":"VLOOKUP(DB35,'User Traffic Profile 1'!$A$9:$F$128,6,FALSE)","v":0},{"$f":"VLOOKUP(DC35,'User Traffic Profile 1'!$A$9:$F$128,6,FALSE)","v":0},{"$f":"VLOOKUP(DD35,'User Traffic Profile 1'!$A$9:$F$128,6,FALSE)","v":0},{"$f":"VLOOKUP(DE35,'User Traffic Profile 1'!$A$9:$F$128,6,FALSE)","v":0},{"$f":"VLOOKUP(DF35,'User Traffic Profile 1'!$A$9:$F$128,6,FALSE)","v":0},{"$f":"VLOOKUP(DG35,'User Traffic Profile 1'!$A$9:$F$128,6,FALSE)","v":0},{"$f":"VLOOKUP(DH35,'User Traffic Profile 1'!$A$9:$F$128,6,FALSE)","v":0},{"$f":"VLOOKUP(DI35,'User Traffic Profile 1'!$A$9:$F$128,6,FALSE)","v":0},{"$f":"VLOOKUP(DJ35,'User Traffic Profile 1'!$A$9:$F$128,6,FALSE)","v":0},{"$f":"VLOOKUP(DK35,'User Traffic Profile 1'!$A$9:$F$128,6,FALSE)","v":0},{"$f":"VLOOKUP(DL35,'User Traffic Profile 1'!$A$9:$F$128,6,FALSE)","v":0},{"$f":"VLOOKUP(DM35,'User Traffic Profile 1'!$A$9:$F$128,6,FALSE)","v":0},{"$f":"VLOOKUP(DN35,'User Traffic Profile 1'!$A$9:$F$128,6,FALSE)","v":0},{"$f":"VLOOKUP(DO35,'User Traffic Profile 1'!$A$9:$F$128,6,FALSE)","v":0},{"$f":"VLOOKUP(DP35,'User Traffic Profile 1'!$A$9:$F$128,6,FALSE)","v":0},{"$f":"VLOOKUP(DQ35,'User Traffic Profile 1'!$A$9:$F$128,6,FALSE)","v":0}]
[]
["DL STAs Scheduled / Frame",{"$f":"IF(B36< $B$5, B36, $B$5)","v":1},{"$f":"IF(C36< $B$5, C36, $B$5)","v":2},3,4,5,6,7,8,8,8,8,8,8,8,8,8,8,8,8,8,8,8,8,8,8,8,8,8,8,8,8,8,8,8,8,8,8,8,8,8,8,8,8,8,8,8,8,8,8,8,8,8,8,8,8,8,8,8,8,8,8,8,8,8,8,{"$f":"IF(BO36< $B$5, BO36, $B$5)","v":8},8,8,8,8,8,8,8,8,8,8,8,8,8,8,8,8,8,8,8,8,8,8,8,8,8,8,8,8,8,8,8,8,8,8,8,8,8,8,8,8,8,8,8,8,8,8,8,8,8,8,8,8,8,8]
["UL STAs Scheduled / Frame",{"$f":"IF(B37< $B$6, B37, $B$6)","v":1},{"$f":"IF(C37< $B$6, C37, $B$6)","v":2},3,4,5,6,7,8,9,9,9,9,9,9,9,9,9,9,9,9,9,9,9,9,9,9,9,9,9,9,9,9,9,9,9,9,9,9,9,9,9,9,9,9,9,9,9,9,9,9,9,9,9,9,9,9,9,9,9,9,9,9,9,9,9,{"$f":"IF(BO37< $B$6, BO37, $B$6)","v":9},9,9,9,9,9,9,9,9,9,9,9,9,9,9,9,9,9,9,9,9,9,9,9,9,9,9,9,9,9,9,9,9,9,9,9,9,9,9,9,9,9,9,9,9,9,9,9,9,9,9,9,9,9,9]
[]
["GPF Time (usec)",{"$f":"VLOOKUP(B40+B41,LookupTab!$H$51:$J$90,3,FALSE)","v":79},{"$f":"VLOOKUP(C40+C41,LookupTab!$H$51:$J$90,3,FALSE)","v":109},{"$f":"VLOOKUP(D40+D41,LookupTab!$H$51:$J$90,3,FALSE)","v":138},{"$f":"VLOOKUP(E40+E41,LookupTab!$H$51:$J$90,3,FALSE)","v":168},{"$f":"VLOOKUP(F40+F41,LookupTab!$H$51:$J$90,3,FALSE)","v":197},{"$f":"VLOOKUP(G40+G41,LookupTab!$H$51:$J$90,3,FALSE)","v":227},{"$f":"VLOOKUP(H40+H41,LookupTab!$H$51:$J$90,3,FALSE)","v":256},{"$f":"VLOOKUP(I40+I41,LookupTab!$H$51:$J$90,3,FALSE)","v":286},{"$f":"VLOOKUP(J40+J41,LookupTab!$H$51:$J$90,3,FALSE)","v":301},{"$f":"VLOOKUP(K40+K41,LookupTab!$H$51:$J$90,3,FALSE)","v":301},{"$f":"VLOOKUP(L40+L41,LookupTab!$H$51:$J$90,3,FALSE)","v":301},{"$f":"VLOOKUP(M40+M41,LookupTab!$H$51:$J$90,3,FALSE)","v":301},{"$f":"VLOOKUP(N40+N41,LookupTab!$H$51:$J$90,3,FALSE)","v":301},{"$f":"VLOOKUP(O40+O41,LookupTab!$H$51:$J$90,3,FALSE)","v":301},{"$f":"VLOOKUP(P40+P41,LookupTab!$H$51:$J$90,3,FALSE)","v":301},{"$f":"VLOOKUP(Q40+Q41,LookupTab!$H$51:$J$90,3,FALSE)","v":301},{"$f":"VLOOKUP(R40+R41,LookupTab!$H$51:$J$90,3,FALSE)","v":301},{"$f":"VLOOKUP(S40+S41,LookupTab!$H$51:$J$90,3,FALSE)","v":301},{"$f":"VLOOKUP(T40+T41,LookupTab!$H$51:$J$90,3,FALSE)","v":301},{"$f":"VLOOKUP(U40+U41,LookupTab!$H$51:$J$90,3,FALSE)","v":301},{"$f":"VLOOKUP(V40+V41,LookupTab!$H$51:$J$90,3,FALSE)","v":301},{"$f":"VLOOKUP(W40+W41,LookupTab!$H$51:$J$90,3,FALSE)","v":301},{"$f":"VLOOKUP(X40+X41,LookupTab!$H$51:$J$90,3,FALSE)","v":301},{"$f":"VLOOKUP(Y40+Y41,LookupTab!$H$51:$J$90,3,FALSE)","v":301},{"$f":"VLOOKUP(Z40+Z41,LookupTab!$H$51:$J$90,3,FALSE)","v":301},{"$f":"VLOOKUP(AA40+AA41,LookupTab!$H$51:$J$90,3,FALSE)","v":301},{"$f":"VLOOKUP(AB40+AB41,LookupTab!$H$51:$J$90,3,FALSE)","v":301},{"$f":"VLOOKUP(AC40+AC41,LookupTab!$H$51:$J$90,3,FALSE)","v":301},{"$f":"VLOOKUP(AD40+AD41,LookupTab!$H$51:$J$90,3,FALSE)","v":301},{"$f":"VLOOKUP(AE40+AE41,LookupTab!$H$51:$J$90,3,FALSE)","v":301},{"$f":"VLOOKUP(AF40+AF41,LookupTab!$H$51:$J$90,3,FALSE)","v":301},{"$f":"VLOOKUP(AG40+AG41,LookupTab!$H$51:$J$90,3,FALSE)","v":301},{"$f":"VLOOKUP(AH40+AH41,LookupTab!$H$51:$J$90,3,FALSE)","v":301},{"$f":"VLOOKUP(AI40+AI41,LookupTab!$H$51:$J$90,3,FALSE)","v":301},{"$f":"VLOOKUP(AJ40+AJ41,LookupTab!$H$51:$J$90,3,FALSE)","v":301},{"$f":"VLOOKUP(AK40+AK41,LookupTab!$H$51:$J$90,3,FALSE)","v":301},{"$f":"VLOOKUP(AL40+AL41,LookupTab!$H$51:$J$90,3,FALSE)","v":301},{"$f":"VLOOKUP(AM40+AM41,LookupTab!$H$51:$J$90,3,FALSE)","v":301},{"$f":"VLOOKUP(AN40+AN41,LookupTab!$H$51:$J$90,3,FALSE)","v":301},{"$f":"VLOOKUP(AO40+AO41,LookupTab!$H$51:$J$90,3,FALSE)","v":301},{"$f":"VLOOKUP(AP40+AP41,LookupTab!$H$51:$J$90,3,FALSE)","v":301},{"$f":"VLOOKUP(AQ40+AQ41,LookupTab!$H$51:$J$90,3,FALSE)","v":301},{"$f":"VLOOKUP(AR40+AR41,LookupTab!$H$51:$J$90,3,FALSE)","v":301},{"$f":"VLOOKUP(AS40+AS41,LookupTab!$H$51:$J$90,3,FALSE)","v":301},{"$f":"VLOOKUP(AT40+AT41,LookupTab!$H$51:$J$90,3,FALSE)","v":301},{"$f":"VLOOKUP(AU40+AU41,LookupTab!$H$51:$J$90,3,FALSE)","v":301},{"$f":"VLOOKUP(AV40+AV41,LookupTab!$H$51:$J$90,3,FALSE)","v":301},{"$f":"VLOOKUP(AW40+AW41,LookupTab!$H$51:$J$90,3,FALSE)","v":301},{"$f":"VLOOKUP(AX40+AX41,LookupTab!$H$51:$J$90,3,FALSE)","v":301},{"$f":"VLOOKUP(AY40+AY41,LookupTab!$H$51:$J$90,3,FALSE)","v":301},{"$f":"VLOOKUP(AZ40+AZ41,LookupTab!$H$51:$J$90,3,FALSE)","v":301},{"$f":"VLOOKUP(BA40+BA41,LookupTab!$H$51:$J$90,3,FALSE)","v":301},{"$f":"VLOOKUP(BB40+BB41,LookupTab!$H$51:$J$90,3,FALSE)","v":301},{"$f":"VLOOKUP(BC40+BC41,LookupTab!$H$51:$J$90,3,FALSE)","v":301},{"$f":"VLOOKUP(BD40+BD41,LookupTab!$H$51:$J$90,3,FALSE)","v":301},{"$f":"VLOOKUP(BE40+BE41,LookupTab!$H$51:$J$90,3,FALSE)","v":301},{"$f":"VLOOKUP(BF40+BF41,LookupTab!$H$51:$J$90,3,FALSE)","v":301},{"$f":"VLOOKUP(BG40+BG41,LookupTab!$H$51:$J$90,3,FALSE)","v":301},{"$f":"VLOOKUP(BH40+BH41,LookupTab!$H$51:$J$90,3,FALSE)","v":301},{"$f":"VLOOKUP(BI40+BI41,LookupTab!$H$51:$J$90,3,FALSE)","v":301},{"$f":"VLOOKUP(BJ40+BJ41,LookupTab!$H$51:$J$90,3,FALSE)","v":301},{"$f":"VLOOKUP(BK40+BK41,LookupTab!$H$51:$J$90,3,FALSE)","v":301},{"$f":"VLOOKUP(BL40+BL41,LookupTab!$H$51:$J$90,3,FALSE)","v":301},{"$f":"VLOOKUP(BM40+BM41,LookupTab!$H$51:$J$90,3,FALSE)","v":301},{"$f":"VLOOKUP(BN40+BN41,LookupTab!$H$51:$J$90,3,FALSE)","v":301},{"$f":"VLOOKUP(BO40+BO41,LookupTab!$H$51:$J$90,3,FALSE)","v":301},{"$f":"VLOOKUP(BP40+BP41,LookupTab!$H$51:$J$90,3,FALSE)","v":301},{"$f":"VLOOKUP(BQ40+BQ41,LookupTab!$H$51:$J$90,3,FALSE)","v":301},{"$f":"VLOOKUP(BR40+BR41,LookupTab!$H$51:$J$90,3,FALSE)","v":301},{"$f":"VLOOKUP(BS40+BS41,LookupTab!$H$51:$J$90,3,FALSE)","v":301},{"$f":"VLOOKUP(BT40+BT41,LookupTab!$H$51:$J$90,3,FALSE)","v":301},{"$f":"VLOOKUP(BU40+BU41,LookupTab!$H$51:$J$90,3,FALSE)","v":301},{"$f":"VLOOKUP(BV40+BV41,LookupTab!$H$51:$J$90,3,FALSE)","v":301},{"$f":"VLOOKUP(BW40+BW41,LookupTab!$H$51:$J$90,3,FALSE)","v":301},{"$f":"VLOOKUP(BX40+BX41,LookupTab!$H$51:$J$90,3,FALSE)","v":301},{"$f":"VLOOKUP(BY40+BY41,LookupTab!$H$51:$J$90,3,FALSE)","v":301},{"$f":"VLOOKUP(BZ40+BZ41,LookupTab!$H$51:$J$90,3,FALSE)","v":301},{"$f":"VLOOKUP(CA40+CA41,LookupTab!$H$51:$J$90,3,FALSE)","v":301},{"$f":"VLOOKUP(CB40+CB41,LookupTab!$H$51:$J$90,3,FALSE)","v":301},{"$f":"VLOOKUP(CC40+CC41,LookupTab!$H$51:$J$90,3,FALSE)","v":301},{"$f":"VLOOKUP(CD40+CD41,LookupTab!$H$51:$J$90,3,FALSE)","v":301},{"$f":"VLOOKUP(CE40+CE41,LookupTab!$H$51:$J$90,3,FALSE)","v":301},{"$f":"VLOOKUP(CF40+CF41,LookupTab!$H$51:$J$90,3,FALSE)","v":301},{"$f":"VLOOKUP(CG40+CG41,LookupTab!$H$51:$J$90,3,FALSE)","v":301},{"$f":"VLOOKUP(CH40+CH41,LookupTab!$H$51:$J$90,3,FALSE)","v":301},{"$f":"VLOOKUP(CI40+CI41,LookupTab!$H$51:$J$90,3,FALSE)","v":301},{"$f":"VLOOKUP(CJ40+CJ41,LookupTab!$H$51:$J$90,3,FALSE)","v":301},{"$f":"VLOOKUP(CK40+CK41,LookupTab!$H$51:$J$90,3,FALSE)","v":301},{"$f":"VLOOKUP(CL40+CL41,LookupTab!$H$51:$J$90,3,FALSE)","v":301},{"$f":"VLOOKUP(CM40+CM41,LookupTab!$H$51:$J$90,3,FALSE)","v":301},{"$f":"VLOOKUP(CN40+CN41,LookupTab!$H$51:$J$90,3,FALSE)","v":301},{"$f":"VLOOKUP(CO40+CO41,LookupTab!$H$51:$J$90,3,FALSE)","v":301},{"$f":"VLOOKUP(CP40+CP41,LookupTab!$H$51:$J$90,3,FALSE)","v":301},{"$f":"VLOOKUP(CQ40+CQ41,LookupTab!$H$51:$J$90,3,FALSE)","v":301},{"$f":"VLOOKUP(CR40+CR41,LookupTab!$H$51:$J$90,3,FALSE)","v":301},{"$f":"VLOOKUP(CS40+CS41,LookupTab!$H$51:$J$90,3,FALSE)","v":301},{"$f":"VLOOKUP(CT40+CT41,LookupTab!$H$51:$J$90,3,FALSE)","v":301},{"$f":"VLOOKUP(CU40+CU41,LookupTab!$H$51:$J$90,3,FALSE)","v":301},{"$f":"VLOOKUP(CV40+CV41,LookupTab!$H$51:$J$90,3,FALSE)","v":301},{"$f":"VLOOKUP(CW40+CW41,LookupTab!$H$51:$J$90,3,FALSE)","v":301},{"$f":"VLOOKUP(CX40+CX41,LookupTab!$H$51:$J$90,3,FALSE)","v":301},{"$f":"VLOOKUP(CY40+CY41,LookupTab!$H$51:$J$90,3,FALSE)","v":301},{"$f":"VLOOKUP(CZ40+CZ41,LookupTab!$H$51:$J$90,3,FALSE)","v":301},{"$f":"VLOOKUP(DA40+DA41,LookupTab!$H$51:$J$90,3,FALSE)","v":301},{"$f":"VLOOKUP(DB40+DB41,LookupTab!$H$51:$J$90,3,FALSE)","v":301},{"$f":"VLOOKUP(DC40+DC41,LookupTab!$H$51:$J$90,3,FALSE)","v":301},{"$f":"VLOOKUP(DD40+DD41,LookupTab!$H$51:$J$90,3,FALSE)","v":301},{"$f":"VLOOKUP(DE40+DE41,LookupTab!$H$51:$J$90,3,FALSE)","v":301},{"$f":"VLOOKUP(DF40+DF41,LookupTab!$H$51:$J$90,3,FALSE)","v":301},{"$f":"VLOOKUP(DG40+DG41,LookupTab!$H$51:$J$90,3,FALSE)","v":301},{"$f":"VLOOKUP(DH40+DH41,LookupTab!$H$51:$J$90,3,FALSE)","v":301},{"$f":"VLOOKUP(DI40+DI41,LookupTab!$H$51:$J$90,3,FALSE)","v":301},{"$f":"VLOOKUP(DJ40+DJ41,LookupTab!$H$51:$J$90,3,FALSE)","v":301},{"$f":"VLOOKUP(DK40+DK41,LookupTab!$H$51:$J$90,3,FALSE)","v":301},{"$f":"VLOOKUP(DL40+DL41,LookupTab!$H$51:$J$90,3,FALSE)","v":301},{"$f":"VLOOKUP(DM40+DM41,LookupTab!$H$51:$J$90,3,FALSE)","v":301},{"$f":"VLOOKUP(DN40+DN41,LookupTab!$H$51:$J$90,3,FALSE)","v":301},{"$f":"VLOOKUP(DO40+DO41,LookupTab!$H$51:$J$90,3,FALSE)","v":301},{"$f":"VLOOKUP(DP40+DP41,LookupTab!$H$51:$J$90,3,FALSE)","v":301},{"$f":"VLOOKUP(DQ40+DQ41,LookupTab!$H$51:$J$90,3,FALSE)","v":301}]
[]
["Per STA Time in the DL  (usec)",{"$f":" ROUNDDOWN((($B$24 - B43)-(($B$8+$B$20)*B40))/B40,0)","v":2340},{"$f":" ROUNDDOWN((($B$24 - C43)-(($B$8+$B$20)*C40))/C40,0)","v":1133},{"$f":" ROUNDDOWN((($B$24 - D43)-(($B$8+$B$20)*D40))/D40,0)","v":731},529,409,328,271,228,226,226,226,226,226,226,226,226,226,226,226,226,226,226,226,226,226,226,226,226,226,226,226,226,226,226,226,226,226,226,226,226,226,226,226,226,226,226,226,226,226,226,226,226,226,226,226,226,226,226,226,226,226,226,226,226,226,226,{"$f":" ROUNDDOWN((($B$24 - BP43)-(($B$8+$B$20)*BP40))/BP40,0)","v":226},226,226,226,226,226,226,226,226,226,226,226,226,226,226,226,226,226,226,226,226,226,226,226,226,226,226,226,226,226,226,226,226,226,226,226,226,226,226,226,226,226,226,226,226,226,226,226,226,226,226,226,226,226]
["Per STA Time in the UL  (usec)",{"$f":" ROUNDDOWN(($B$25-(($B$8+$B$21)*B41))/B41,0)","v":2363},{"$f":" ROUNDDOWN(($B$25-(($B$8+$B$21)*C41))/C41,0)","v":1158},{"$f":" ROUNDDOWN(($B$25-(($B$8+$B$21)*D41))/D41,0)","v":757},{"$f":" ROUNDDOWN(($B$25-(($B$8+$B$21)*E41))/E41,0)","v":556},{"$f":" ROUNDDOWN(($B$25-(($B$8+$B$21)*F41))/F41,0)","v":435},355,298,255,221,221,221,221,221,221,221,221,221,221,221,221,221,221,221,221,221,221,221,221,221,221,221,221,221,221,221,221,221,221,221,221,221,221,221,221,221,221,221,221,221,221,221,221,221,221,221,221,221,221,221,221,221,221,221,221,221,221,221,{"$f":" ROUNDDOWN(($B$25-(($B$8+$B$21)*BQ41))/BQ41,0)","v":221},221,221,221,221,221,221,221,221,221,221,221,221,221,221,221,221,221,221,221,221,221,221,221,221,221,221,221,221,221,221,221,221,221,221,221,221,221,221,221,221,221,221,221,221,221,221,221,221,221,221,221,221]
["Per STA Time in the UL execluding ARQ ACK frame time (usec)",{"$f":"B46-$B$29","v":2285},{"$f":"C46-$B$29","v":1080},679,478,357,277,220,177,143,143,143,143,143,143,143,143,143,143,143,143,143,143,143,143,143,143,143,143,143,143,143,143,143,143,143,143,143,143,143,143,143,143,143,143,143,143,143,143,143,143,143,143,143,143,143,143,143,143,143,143,143,143,143,143,143,{"$f":"BO46-$B$29","v":143},143,143,143,143,143,143,143,143,143,143,143,143,143,143,143,143,143,143,143,143,143,143,143,143,143,143,143,143,143,143,143,143,143,143,143,143,143,143,143,143,143,143,143,143,143,143,143,143,143,143,143,143,143,143]
[]
["DL Max Packets per STA per Frame based on CPU PPF limit",{"$f":"ROUNDDOWN($B$3/B40,0)","v":100},50,33,25,20,16,14,12,12,{"$f":"ROUNDDOWN($B$3/K40,0)","v":12},12,12,12,12,12,12,12,12,12,12,12,12,12,12,12,12,12,12,12,12,12,12,12,12,12,12,12,12,12,12,12,12,12,12,12,12,12,12,12,12,12,12,12,12,12,12,12,12,12,12,12,12,12,12,{"$f":"ROUNDDOWN($B$3/BN40,0)","v":12},12,12,12,12,12,12,12,12,12,12,12,12,12,12,12,12,12,12,12,12,12,12,12,12,12,12,12,12,12,12,12,12,12,12,12,12,12,12,12,12,12,12,12,12,12,12,12,12,12,12,12,12,12,12,12]
["# of DL packets /Scheduled STA/frame",{"$f":"ROUND((B45)/($B$32+$B$18),1)","v":2.4},1.2,0.8,0.6,0.4,0.3,0.3,0.2,0.2,0.2,0.2,0.2,0.2,0.2,0.2,0.2,0.2,0.2,0.2,0.2,0.2,0.2,0.2,0.2,0.2,0.2,0.2,0.2,0.2,0.2,0.2,0.2,0.2,0.2,0.2,0.2,0.2,0.2,0.2,0.2,0.2,0.2,0.2,0.2,0.2,0.2,0.2,0.2,0.2,0.2,0.2,0.2,0.2,0.2,0.2,0.2,0.2,0.2,0.2,0.2,0.2,0.2,0.2,0.2,{"$f":"ROUND((BN45)/($B$32+$B$18),1)","v":0.2},0.2,0.2,0.2,0.2,0.2,0.2,0.2,0.2,0.2,0.2,0.2,0.2,0.2,0.2,0.2,0.2,0.2,0.2,0.2,0.2,0.2,0.2,0.2,0.2,0.2,0.2,0.2,0.2,0.2,0.2,0.2,0.2,0.2,0.2,0.2,0.2,0.2,0.2,0.2,0.2,0.2,0.2,0.2,0.2,0.2,0.2,0.2,0.2,0.2,0.2,0.2,0.2,0.2,0.2,0.2]
["# of DL packets /Scheduled STA/frame (w/ CPU PPF Limit)",{"$f":"MIN(B49,B50)","v":2.4},{"$f":"MIN(C49,C50)","v":1.2},0.8,0.6,0.4,0.3,0.3,0.2,0.2,0.2,0.2,0.2,0.2,0.2,0.2,0.2,0.2,0.2,0.2,0.2,0.2,0.2,0.2,0.2,0.2,0.2,0.2,0.2,0.2,0.2,0.2,0.2,0.2,0.2,0.2,0.2,0.2,0.2,0.2,0.2,0.2,0.2,0.2,0.2,0.2,0.2,0.2,0.2,0.2,0.2,0.2,0.2,0.2,0.2,0.2,0.2,0.2,0.2,0.2,0.2,0.2,0.2,0.2,0.2,0.2,{"$f":"MIN(BO49,BO50)","v":0.2},0.2,0.2,0.2,0.2,0.2,0.2,0.2,0.2,0.2,0.2,0.2,0.2,0.2,0.2,0.2,0.2,0.2,0.2,0.2,0.2,0.2,0.2,0.2,0.2,0.2,0.2,0.2,0.2,0.2,0.2,0.2,0.2,0.2,0.2,0.2,0.2,0.2,0.2,0.2,0.2,0.2,0.2,0.2,0.2,0.2,0.2,0.2,0.2,0.2,0.2,0.2,0.2,0.2,0.2]
[]
["UL Max Packets per STA per Frame based on CPU PPF limit",{"$f":"ROUNDDOWN($B$4/B41,0)","v":100},{"$f":"ROUNDDOWN($B$4/C41,0)","v":50},33,25,20,16,14,12,11,11,11,11,11,11,11,11,11,11,11,11,11,11,11,11,11,11,11,11,11,11,11,11,11,11,11,11,11,11,11,11,11,11,11,11,11,11,11,11,11,11,11,11,11,11,11,11,11,11,11,11,11,11,11,11,11,{"$f":"ROUNDDOWN($B$4/BO41,0)","v":11},11,11,11,11,11,11,11,11,11,11,11,11,11,11,11,11,11,11,11,11,11,11,11,11,11,11,11,11,11,11,11,11,11,11,11,11,11,11,11,11,11,11,11,11,11,11,11,11,11,11,11,11,11,11]
["# of UL packets /Scheduled STA/frame",{"$f":"ROUND((B47)/($B$32+$B$19),1)","v":2.4},1.1000000000000001,0.7,0.5,0.4,0.3,0.2,0.2,0.1,0.1,0.1,0.1,0.1,0.1,0.1,0.1,0.1,0.1,0.1,0.1,0.1,0.1,0.1,0.1,0.1,0.1,0.1,0.1,0.1,0.1,0.1,0.1,0.1,0.1,0.1,0.1,0.1,0.1,0.1,0.1,0.1,0.1,0.1,0.1,0.1,0.1,0.1,0.1,0.1,0.1,0.1,0.1,0.1,0.1,0.1,0.1,0.1,0.1,0.1,0.1,0.1,0.1,0.1,0.1,{"$f":"ROUND((BN47)/($B$32+$B$19),1)","v":0.1},0.1,0.1,0.1,0.1,0.1,0.1,0.1,0.1,0.1,0.1,0.1,0.1,0.1,0.1,0.1,0.1,0.1,0.1,0.1,0.1,0.1,0.1,0.1,0.1,0.1,0.1,0.1,0.1,0.1,0.1,0.1,0.1,0.1,0.1,0.1,0.1,0.1,0.1,0.1,0.1,0.1,0.1,0.1,0.1,0.1,0.1,0.1,0.1,0.1,0.1,0.1,0.1,0.1,0.1,0.1]
["# of UL packets /Scheduled STA/frame (w/ CPU PPF Limit)",{"$f":"MIN(B53,B54)","v":2.4},{"$f":"MIN(C53,C54)","v":1.1000000000000001},0.7,0.5,0.4,0.3,0.2,0.2,0.1,0.1,0.1,0.1,0.1,0.1,0.1,0.1,0.1,0.1,0.1,0.1,0.1,0.1,0.1,0.1,0.1,0.1,0.1,0.1,0.1,0.1,0.1,0.1,0.1,0.1,0.1,0.1,0.1,0.1,0.1,0.1,0.1,0.1,0.1,0.1,0.1,0.1,0.1,0.1,0.1,0.1,0.1,0.1,0.1,0.1,0.1,0.1,0.1,0.1,0.1,0.1,0.1,0.1,0.1,0.1,0.1,{"$f":"MIN(BO53,BO54)","v":0.1},0.1,0.1,0.1,0.1,0.1,0.1,0.1,0.1,0.1,0.1,0.1,0.1,0.1,0.1,0.1,0.1,0.1,0.1,0.1,0.1,0.1,0.1,0.1,0.1,0.1,0.1,0.1,0.1,0.1,0.1,0.1,0.1,0.1,0.1,0.1,0.1,0.1,0.1,0.1,0.1,0.1,0.1,0.1,0.1,0.1,0.1,0.1,0.1,0.1,0.1,0.1,0.1,0.1,0.1]
[]
["PPS Calculation"]
["DL PPS (KPPS)",{"$f":"ROUNDUP(B51*B40,0)*$B$9/1000","v":0.6},{"$f":"ROUNDUP(C51*C40,0)*$B$9/1000","v":0.6},0.6,0.6,0.4,0.4,0.6,0.4,0.4,0.4,0.4,0.4,0.4,0.4,0.4,0.4,0.4,0.4,0.4,0.4,0.4,0.4,0.4,0.4,0.4,0.4,0.4,0.4,0.4,0.4,0.4,0.4,0.4,0.4,0.4,0.4,0.4,0.4,0.4,0.4,0.4,0.4,0.4,0.4,0.4,0.4,0.4,0.4,0.4,0.4,0.4,0.4,0.4,0.4,0.4,0.4,0.4,0.4,0.4,0.4,0.4,0.4,0.4,0.4,0.4,{"$f":"ROUNDUP(BO51*BO40,0)*$B$9/1000","v":0.4},0.4,0.4,0.4,0.4,0.4,0.4,0.4,0.4,0.4,0.4,0.4,0.4,0.4,0.4,0.4,0.4,0.4,0.4,0.4,0.4,0.4,0.4,0.4,0.4,0.4,0.4,0.4,0.4,0.4,0.4,0.4,0.4,0.4,0.4,0.4,0.4,0.4,0.4,0.4,0.4,0.4,0.4,0.4,0.4,0.4,0.4,0.4,0.4,0.4,0.4,0.4,0.4,0.4,0.4]
["UL PPS (KPPS)",{"$f":"ROUNDUP(B55*B41,0)*$B$9/1000","v":0.6},{"$f":"ROUNDUP(C55*C41,0)*$B$9/1000","v":0.6},0.6,0.4,0.4,0.4,0.4,0.4,0.2,0.2,0.2,0.2,0.2,0.2,0.2,0.2,0.2,0.2,0.2,0.2,0.2,0.2,0.2,0.2,0.2,0.2,0.2,0.2,0.2,0.2,0.2,0.2,0.2,0.2,0.2,0.2,0.2,0.2,0.2,0.2,0.2,0.2,0.2,0.2,0.2,0.2,0.2,0.2,0.2,0.2,0.2,0.2,0.2,0.2,0.2,0.2,0.2,0.2,0.2,0.2,0.2,0.2,0.2,0.2,0.2,{"$f":"ROUNDUP(BO55*BO41,0)*$B$9/1000","v":0.2},0.2,0.2,0.2,0.2,0.2,0.2,0.2,0.2,0.2,0.2,0.2,0.2,0.2,0.2,0.2,0.2,0.2,0.2,0.2,0.2,0.2,0.2,0.2,0.2,0.2,0.2,0.2,0.2,0.2,0.2,0.2,0.2,0.2,0.2,0.2,0.2,0.2,0.2,0.2,0.2,0.2,0.2,0.2,0.2,0.2,0.2,0.2,0.2,0.2,0.2,0.2,0.2,0.2,0.2]
["Total PPS (KPPS)",{"$f":"SUM(B58:B59)","v":1.2},{"$f":"SUM(C58:C59)","v":1.2},1.2,1,0.8,0.8,1,0.8,0.60000000000000009,0.60000000000000009,0.60000000000000009,0.60000000000000009,0.60000000000000009,0.60000000000000009,0.60000000000000009,0.60000000000000009,0.60000000000000009,0.60000000000000009,0.60000000000000009,0.60000000000000009,0.60000000000000009,0.60000000000000009,0.60000000000000009,0.60000000000000009,0.60000000000000009,0.60000000000000009,0.60000000000000009,0.60000000000000009,0.60000000000000009,0.60000000000000009,0.60000000000000009,0.60000000000000009,0.60000000000000009,0.60000000000000009,0.60000000000000009,0.60000000000000009,0.60000000000000009,0.60000000000000009,0.60000000000000009,0.60000000000000009,0.60000000000000009,0.60000000000000009,0.60000000000000009,0.60000000000000009,0.60000000000000009,0.60000000000000009,0.60000000000000009,0.60000000000000009,0.60000000000000009,0.60000000000000009,0.60000000000000009,0.60000000000000009,0.60000000000000009,0.60000000000000009,0.60000000000000009,0.60000000000000009,0.60000000000000009,0.60000000000000009,0.60000000000000009,0.60000000000000009,0.60000000000000009,0.60000000000000009,0.60000000000000009,0.60000000000000009,0.60000000000000009,{"$f":"SUM(BO58:BO59)","v":0.60000000000000009},0.60000000000000009,0.60000000000000009,0.60000000000000009,0.60000000000000009,0.60000000000000009,0.60000000000000009,0.60000000000000009,0.60000000000000009,0.60000000000000009,0.60000000000000009,0.60000000000000009,0.60000000000000009,0.60000000000000009,0.60000000000000009,0.60000000000000009,0.60000000000000009,0.60000000000000009,0.60000000000000009,0.60000000000000009,0.60000000000000009,0.60000000000000009,0.60000000000000009,0.60000000000000009,0.60000000000000009,0.60000000000000009,0.60000000000000009,0.60000000000000009,0.60000000000000009,0.60000000000000009,0.60000000000000009,0.60000000000000009,0.60000000000000009,0.60000000000000009,0.60000000000000009,0.60000000000000009,0.60000000000000009,0.60000000000000009,0.60000000000000009,0.60000000000000009,0.60000000000000009,0.60000000000000009,0.60000000000000009,0.60000000000000009,0.60000000000000009,0.60000000000000009,0.60000000000000009,0.60000000000000009,0.60000000000000009,0.60000000000000009,0.60000000000000009,0.60000000000000009,0.60000000000000009,0.60000000000000009,0.60000000000000009]
[]
["Throughput Calculation"]
["DL STA is scheduled every (frame)",{"$f":"IF(B36<= $B$5, 1, B36/$B$5)","v":1},1,1,1,1,1,1,1,1.125,1.25,1.375,1.5,1.625,1.75,1.875,2,2.125,2.25,2.375,2.5,2.625,2.75,2.875,3,3.125,3.25,3.375,3.5,3.625,3.75,3.875,4,4.125,4.25,4.375,4.5,4.625,4.75,4.875,5,5.125,5.25,5.375,5.5,5.625,5.75,5.875,6,6.125,6.25,6.375,6.5,6.625,6.75,6.875,7,7.125,7.25,7.375,7.5,7.625,7.75,7.875,8,{"$f":"IF(BN36<= $B$5, 1, BN36/$B$5)","v":8.125},8.25,8.375,8.5,8.625,8.75,8.875,9,9.125,9.25,9.375,9.5,9.625,9.75,9.875,10,10.125,10.25,10.375,10.5,10.625,10.75,10.875,11,11.125,11.25,11.375,11.5,11.625,11.75,11.875,12,12.125,12.25,12.375,12.5,12.625,12.75,12.875,13,13.125,13.25,13.375,13.5,13.625,13.75,13.875,14,14.125,14.25,14.375,14.5,14.625,14.75,14.875,15]
["STA's DL UDP Throughput (Mbps)",{"$f":"ROUND(B51*$B$14*8*$B$9/1024/1024/B63,2)","v":5.39},2.7,1.8,1.35,0.9,0.67,0.67,0.45,0.4,0.36,0.33,0.3,0.28000000000000003,0.26,0.24,0.22,0.21,0.2,0.19,0.18,0.17,0.16,0.16,0.15,0.14000000000000001,0.14000000000000001,0.13,0.13,0.12,0.12,0.12,0.11,0.11,0.11,0.1,0.1,0.1,0.09,0.09,0.09,0.09,0.09,0.08,0.08,0.08,0.08,0.08,7.0000000000000007E-2,7.0000000000000007E-2,7.0000000000000007E-2,7.0000000000000007E-2,7.0000000000000007E-2,7.0000000000000007E-2,7.0000000000000007E-2,7.0000000000000007E-2,0.06,0.06,0.06,0.06,0.06,0.06,0.06,0.06,0.06,{"$f":"ROUND(BN51*$B$14*8*$B$9/1024/1024/BN63,2)","v":0.06},0.05,0.05,0.05,0.05,0.05,0.05,0.05,0.05,0.05,0.05,0.05,0.05,0.05,0.05,0.04,0.04,0.04,0.04,0.04,0.04,0.04,0.04,0.04,0.04,0.04,0.04,0.04,0.04,0.04,0.04,0.04,0.04,0.04,0.04,0.04,0.04,0.04,0.03,0.03,0.03,0.03,0.03,0.03,0.03,0.03,0.03,0.03,0.03,0.03,0.03,0.03,0.03,0.03,0.03,0.03]
["Sector DL UDP Throughput (Mbps)",{"$f":"B64*B36","v":5.39},5.4,5.4,5.4,4.5,4.0200000000000005,4.6900000000000004,3.6,3.6,3.5999999999999996,3.6300000000000003,3.5999999999999996,3.6400000000000006,3.64,3.5999999999999996,3.52,3.57,3.6,3.61,3.5999999999999996,3.5700000000000003,3.52,3.68,3.5999999999999996,3.5000000000000004,3.6400000000000006,3.5100000000000002,3.64,3.48,3.5999999999999996,3.7199999999999998,3.52,3.63,3.74,3.5,3.6,3.7,3.42,3.51,3.5999999999999996,3.69,3.78,3.44,3.52,3.6,3.68,3.7600000000000002,3.3600000000000003,3.43,3.5000000000000004,3.5700000000000003,3.6400000000000006,3.7100000000000004,3.7800000000000002,3.8500000000000005,3.36,3.42,3.48,3.54,3.5999999999999996,3.6599999999999997,3.7199999999999998,3.78,3.84,{"$f":"BN64*BN36","v":3.9},3.3000000000000003,3.35,3.4000000000000004,3.45,3.5,3.5500000000000003,3.6,3.6500000000000004,3.7,3.75,3.8000000000000003,3.85,3.9000000000000004,3.95,3.2,3.24,3.2800000000000002,3.3200000000000003,3.36,3.4,3.44,3.48,3.52,3.56,3.6,3.64,3.68,3.72,3.7600000000000002,3.8000000000000003,3.84,3.88,3.92,3.96,4,4.04,4.08,3.09,3.12,3.15,3.1799999999999997,3.21,3.2399999999999998,3.27,3.3,3.33,3.36,3.3899999999999997,3.42,3.4499999999999997,3.48,3.51,3.54,3.57,3.5999999999999996]
[]
["UL STA is scheduled every (frame)",{"$f":"IF(B37<= $B$6, 1, B37/$B$6)","v":1},{"$f":"IF(C37<= $B$6, 1, C37/$B$6)","v":1},1,1,1,1,1,1,1,1.1111111111111112,1.2222222222222223,1.3333333333333333,1.4444444444444444,1.5555555555555556,1.6666666666666667,1.7777777777777777,1.8888888888888888,2,2.1111111111111112,2.2222222222222223,2.3333333333333335,2.4444444444444446,2.5555555555555554,2.6666666666666665,2.7777777777777777,2.8888888888888888,3,3.1111111111111112,3.2222222222222223,3.3333333333333335,3.4444444444444446,3.5555555555555554,3.6666666666666665,3.7777777777777777,3.8888888888888888,4,4.1111111111111107,4.2222222222222223,4.333333333333333,4.4444444444444446,4.5555555555555554,4.666666666666667,4.7777777777777777,4.8888888888888893,5,5.1111111111111107,5.2222222222222223,5.333333333333333,5.4444444444444446,5.5555555555555554,5.666666666666667,5.7777777777777777,5.8888888888888893,6,6.1111111111111107,6.2222222222222223,6.333333333333333,6.4444444444444446,6.5555555555555554,6.666666666666667,6.7777777777777777,6.8888888888888893,7,7.1111111111111107,7.2222222222222223,{"$f":"IF(BO37<= $B$6, 1, BO37/$B$6)","v":7.333333333333333},7.4444444444444446,7.5555555555555554,7.666666666666667,7.7777777777777777,7.8888888888888893,8,8.1111111111111107,8.2222222222222214,8.3333333333333339,8.4444444444444446,8.5555555555555554,8.6666666666666661,8.7777777777777786,8.8888888888888893,9,9.1111111111111107,9.2222222222222214,9.3333333333333339,9.4444444444444446,9.5555555555555554,9.6666666666666661,9.7777777777777786,9.8888888888888893,10,10.111111111111111,10.222222222222221,10.333333333333334,10.444444444444445,10.555555555555555,10.666666666666666,10.777777777777779,10.888888888888889,11,11.111111111111111,11.222222222222221,11.333333333333334,11.444444444444445,11.555555555555555,11.666666666666666,11.777777777777779,11.888888888888889,12,12.111111111111111,12.222222222222221,12.333333333333334,12.444444444444445,12.555555555555555,12.666666666666666,12.777777777777779,12.888888888888889,13,13.111111111111111,13.222222222222221,13.333333333333334]
["STA's UL UDP Throughput (Mbps)",{"$f":"ROUND(B55*$B$14*8*$B$9/1024/1024/B67,2)","v":5.39},{"$f":"ROUND(C55*$B$14*8*$B$9/1024/1024/C67,2)","v":2.4700000000000002},1.57,1.1200000000000001,0.9,0.67,0.45,0.45,0.22,0.2,0.18,0.17,0.16,0.14000000000000001,0.13,0.13,0.12,0.11,0.11,0.1,0.1,0.09,0.09,0.08,0.08,0.08,7.0000000000000007E-2,7.0000000000000007E-2,7.0000000000000007E-2,7.0000000000000007E-2,7.0000000000000007E-2,0.06,0.06,0.06,0.06,0.06,0.05,0.05,0.05,0.05,0.05,0.05,0.05,0.05,0.04,0.04,0.04,0.04,0.04,0.04,0.04,0.04,0.04,0.04,0.04,0.04,0.04,0.03,0.03,0.03,0.03,0.03,0.03,0.03,0.03,{"$f":"ROUND(BO55*$B$14*8*$B$9/1024/1024/BO67,2)","v":0.03},0.03,0.03,0.03,0.03,0.03,0.03,0.03,0.03,0.03,0.03,0.03,0.03,0.03,0.03,0.02,0.02,0.02,0.02,0.02,0.02,0.02,0.02,0.02,0.02,0.02,0.02,0.02,0.02,0.02,0.02,0.02,0.02,0.02,0.02,0.02,0.02,0.02,0.02,0.02,0.02,0.02,0.02,0.02,0.02,0.02,0.02,0.02,0.02,0.02,0.02,0.02,0.02,0.02,0.02]
["Sector UL UDP Throughput (Mbps)",{"$f":"B68*B37","v":5.39},4.9400000000000004,4.71,4.4800000000000004,4.5,4.0200000000000005,3.15,3.6,1.98,2,1.98,2.04,2.08,1.9600000000000002,1.9500000000000002,2.08,2.04,1.98,2.09,2,2.1,1.98,2.0699999999999998,1.92,2,2.08,1.8900000000000001,1.9600000000000002,2.0300000000000002,2.1,2.1700000000000004,1.92,1.98,2.04,2.1,2.16,1.85,1.9000000000000001,1.9500000000000002,2,2.0500000000000003,2.1,2.15,2.2000000000000002,1.8,1.84,1.8800000000000001,1.92,1.96,2,2.04,2.08,2.12,2.16,2.2000000000000002,2.2400000000000002,2.2800000000000002,1.74,1.77,1.7999999999999998,1.8299999999999998,1.8599999999999999,1.89,1.92,{"$f":"BN68*BN37","v":1.95},1.98,2.0099999999999998,2.04,2.0699999999999998,2.1,2.13,2.16,2.19,2.2199999999999998,2.25,2.2799999999999998,2.31,2.34,2.37,2.4,1.62,1.6400000000000001,1.6600000000000001,1.68,1.7,1.72,1.74,1.76,1.78,1.8,1.82,1.84,1.86,1.8800000000000001,1.9000000000000001,1.92,1.94,1.96,1.98,2,2.02,2.04,2.06,2.08,2.1,2.12,2.14,2.16,2.1800000000000002,2.2000000000000002,2.2200000000000002,2.2400000000000002,2.2600000000000002,2.2800000000000002,2.3000000000000003,2.3199999999999998,2.34,2.36,2.38,2.4]
[]
["Total Sector Throughput (DL+UL) (Mbps)",{"$f":"B69+B65","v":10.78},10.34,10.11,9.8800000000000008,9,8.0400000000000009,7.84,7.2,5.58,5.6,5.61,5.64,5.7200000000000006,5.6000000000000005,5.55,5.6,5.6099999999999994,5.58,5.6999999999999993,5.6,5.67,5.5,5.75,5.52,5.5,5.7200000000000006,5.4,5.6000000000000005,5.51,5.6999999999999993,5.8900000000000006,5.4399999999999995,5.6099999999999994,5.78,5.6,5.76,5.5500000000000007,5.32,5.46,5.6,5.74,5.88,5.59,5.7200000000000006,5.4,5.5200000000000005,5.6400000000000006,5.28,5.3900000000000006,5.5,5.61,5.7200000000000006,5.83,5.94,6.0500000000000007,5.6,5.7,5.22,5.3100000000000005,5.3999999999999995,5.4899999999999993,5.58,5.67,5.76,{"$f":"BN69+BN65","v":5.85},5.28,5.3599999999999994,5.44,5.52,5.6,5.68,5.76,5.84,5.92,6,6.08,6.16,6.24,6.32,5.6,4.8600000000000003,4.92,4.9800000000000004,5.04,5.0999999999999996,5.16,5.22,5.28,5.34,5.4,5.46,5.5200000000000005,5.58,5.6400000000000006,5.7,5.76,5.82,5.88,5.9399999999999995,6,6.0600000000000005,6.12,5.15,5.2,5.25,5.3,5.35,5.4,5.45,5.5,5.5500000000000007,5.6,5.65,5.7,5.75,5.8,5.85,5.9,5.9499999999999993,6]
[]
["Latency Calculation"]
["AP Scheduling Delay (msec)",{"$f":"B1","v":5}]
["DL Scheduling Latency (msec)",{"$f":"B63*$B$1+$B$74","v":10},10,10,10,10,10,10,10,10.625,11.25,11.875,12.5,13.125,13.75,14.375,15,15.625,16.25,16.875,17.5,18.125,18.75,19.375,20,20.625,21.25,21.875,22.5,23.125,23.75,24.375,25,25.625,26.25,26.875,27.5,28.125,28.75,29.375,30,30.625,31.25,31.875,32.5,33.125,33.75,34.375,35,35.625,36.25,36.875,37.5,38.125,38.75,39.375,40,40.625,41.25,41.875,42.5,43.125,43.75,44.375,45,{"$f":"BN63*$B$1+$B$74","v":45.625},46.25,46.875,47.5,48.125,48.75,49.375,50,50.625,51.25,51.875,52.5,53.125,53.75,54.375,55,55.625,56.25,56.875,57.5,58.125,58.75,59.375,60,60.625,61.25,61.875,62.5,63.125,63.75,64.375,65,65.625,66.25,66.875,67.5,68.125,68.75,69.375,70,70.625,71.25,71.875,72.5,73.125,73.75,74.375,75,75.625,76.25,76.875,77.5,78.125,78.75,79.375,80]
["UL Scheduling Latency (msec)",{"$f":"B67*$B$1+$B$74","v":10},10,10,10,10,10,10,10,10,10.555555555555555,11.111111111111111,11.666666666666666,12.222222222222221,12.777777777777779,13.333333333333334,13.888888888888889,14.444444444444445,15,15.555555555555555,16.111111111111111,16.666666666666668,17.222222222222221,17.777777777777779,18.333333333333332,18.888888888888889,19.444444444444443,20,20.555555555555557,21.111111111111111,21.666666666666668,22.222222222222221,22.777777777777779,23.333333333333332,23.888888888888889,24.444444444444443,25,25.555555555555554,26.111111111111111,26.666666666666664,27.222222222222221,27.777777777777779,28.333333333333336,28.888888888888889,29.444444444444446,30,30.555555555555554,31.111111111111111,31.666666666666664,32.222222222222221,32.777777777777779,33.333333333333336,33.888888888888886,34.444444444444443,35,35.555555555555557,36.111111111111114,36.666666666666664,37.222222222222221,37.777777777777779,38.333333333333336,38.888888888888886,39.444444444444443,40,40.555555555555557,{"$f":"BN67*$B$1+$B$74","v":41.111111111111114},41.666666666666664,42.222222222222221,42.777777777777779,43.333333333333336,43.888888888888886,44.444444444444443,45,45.555555555555557,46.111111111111107,46.666666666666671,47.222222222222221,47.777777777777779,48.333333333333329,48.888888888888893,49.444444444444443,50,50.555555555555557,51.111111111111107,51.666666666666671,52.222222222222221,52.777777777777779,53.333333333333329,53.888888888888893,54.444444444444443,55,55.555555555555557,56.111111111111107,56.666666666666671,57.222222222222221,57.777777777777779,58.333333333333329,58.888888888888893,59.444444444444443,60,60.555555555555557,61.111111111111107,61.666666666666671,62.222222222222221,62.777777777777779,63.333333333333329,63.888888888888893,64.444444444444443,65,65.555555555555557,66.111111111111114,66.666666666666671,67.222222222222229,67.777777777777771,68.333333333333329,68.888888888888886,69.444444444444443,70,70.555555555555557,71.111111111111114,71.666666666666671]
["Total Scheduling Latency DL+UL (msec)",{"$f":"B76+B75","v":20},20,20,20,20,20,20,20,20.625,21.805555555555557,22.986111111111111,24.166666666666664,25.347222222222221,26.527777777777779,27.708333333333336,28.888888888888889,30.069444444444443,31.25,32.430555555555557,33.611111111111114,34.791666666666671,35.972222222222221,37.152777777777779,38.333333333333329,39.513888888888886,40.694444444444443,41.875,43.055555555555557,44.236111111111114,45.416666666666671,46.597222222222221,47.777777777777779,48.958333333333329,50.138888888888886,51.319444444444443,52.5,53.680555555555557,54.861111111111114,56.041666666666664,57.222222222222221,58.402777777777779,59.583333333333336,60.763888888888886,61.944444444444443,63.125,64.305555555555557,65.486111111111114,66.666666666666657,67.847222222222229,69.027777777777771,70.208333333333343,71.388888888888886,72.569444444444443,73.75,74.930555555555557,76.111111111111114,77.291666666666657,78.472222222222229,79.652777777777771,80.833333333333343,82.013888888888886,83.194444444444443,84.375,85.555555555555557,{"$f":"BN76+BN75","v":86.736111111111114},87.916666666666657,89.097222222222229,90.277777777777771,91.458333333333343,92.638888888888886,93.819444444444443,95,96.180555555555557,97.361111111111114,98.541666666666671,99.722222222222229,100.90277777777777,102.08333333333333,103.26388888888889,104.44444444444444,105.625,106.80555555555556,107.98611111111111,109.16666666666667,110.34722222222223,111.52777777777777,112.70833333333333,113.88888888888889,115.06944444444444,116.25,117.43055555555556,118.61111111111111,119.79166666666667,120.97222222222223,122.15277777777777,123.33333333333333,124.51388888888889,125.69444444444444,126.875,128.05555555555554,129.23611111111111,130.41666666666669,131.59722222222223,132.77777777777777,133.95833333333331,135.13888888888889,136.31944444444446,137.5,138.68055555555554,139.86111111111111,141.04166666666669,142.22222222222223,143.40277777777777,144.58333333333331,145.76388888888889,146.94444444444446,148.125,149.30555555555554,150.48611111111111,151.66666666666669]
[]
[]
["Overhead Detail Calculation"]
["DL Preamable Overhead time / frame (usec)",{"$f":"B40*$B$8","v":36},{"$f":"C40*$B$8","v":72},108,144,180,216,252,288,288,288,288,288,288,288,288,288,288,288,288,288,288,288,288,288,288,288,288,288,288,288,288,288,288,288,288,288,288,288,288,288,288,288,288,288,288,288,288,288,288,288,288,288,288,288,288,288,288,288,288,288,288,288,288,288,288,{"$f":"BO40*$B$8","v":288},288,288,288,288,288,288,288,288,288,288,288,288,288,288,288,288,288,288,288,288,288,288,288,288,288,288,288,288,288,288,288,288,288,288,288,288,288,288,288,288,288,288,288,288,288,288,288,288,288,288,288,288,288,288]
["DL GPF Overhead time /frame (usec)",{"$f":"B43","v":79},{"$f":"C43","v":109},138,168,197,227,256,286,301,301,301,301,301,301,301,301,301,301,301,301,301,301,301,301,301,301,301,301,301,301,301,301,301,301,301,301,301,301,301,301,301,301,301,301,301,301,301,301,301,301,301,301,301,301,301,301,301,301,301,301,301,301,301,301,301,{"$f":"BO43","v":301},301,301,301,301,301,301,301,301,301,301,301,301,301,301,301,301,301,301,301,301,301,301,301,301,301,301,301,301,301,301,301,301,301,301,301,301,301,301,301,301,301,301,301,301,301,301,301,301,301,301,301,301,301,301]
["DL Inter-MPDU Spacing  Overhead Time/ frame (usec)",{"$f":"B40*$B$19*ROUNDUP(B51,0)","v":0},{"$f":"C40*$B$19*ROUNDUP(C51,0)","v":0},0,0,0,0,0,0,0,0,0,0,0,0,0,0,0,0,0,0,0,0,0,0,0,0,0,0,0,0,0,0,0,0,0,0,0,0,0,0,0,0,0,0,0,0,0,0,0,0,0,0,0,0,0,0,0,0,0,0,0,0,0,0,0,{"$f":"BO40*$B$19*ROUNDUP(BO51,0)","v":0},0,0,0,0,0,0,0,0,0,0,0,0,0,0,0,0,0,0,0,0,0,0,0,0,0,0,0,0,0,0,0,0,0,0,0,0,0,0,0,0,0,0,0,0,0,0,0,0,0,0,0,0,0,0]
["DL Inter STA Transmission Overhead Time / frame (usec)",{"$f":"(B40-1)*$B$20","v":0},{"$f":"(C40-1)*$B$20","v":8},16,24,32,40,48,56,56,56,56,56,56,56,56,56,56,56,56,56,56,56,56,56,56,56,56,56,56,56,56,56,56,56,56,56,56,56,56,56,56,56,56,56,56,56,56,56,56,56,56,56,56,56,56,56,56,56,56,56,56,56,56,56,56,{"$f":"(BO40-1)*$B$20","v":56},56,56,56,56,56,56,56,56,56,56,56,56,56,56,56,56,56,56,56,56,56,56,56,56,56,56,56,56,56,56,56,56,56,56,56,56,56,56,56,56,56,56,56,56,56,56,56,56,56,56,56,56,56,56]
["DL MAC Management Overhead Time / frame (usec)",{"$f":"ROUND(B54*B41*$B$33,1)","v":59},{"$f":"ROUND(C55*C41*$B$33,1)","v":54.1},51.7,49.2,49.2,44.3,34.4,39.4,22.1,22.1,22.1,22.1,22.1,22.1,22.1,22.1,22.1,22.1,22.1,22.1,22.1,22.1,22.1,22.1,22.1,22.1,22.1,22.1,22.1,22.1,22.1,22.1,22.1,22.1,22.1,22.1,22.1,22.1,22.1,22.1,22.1,22.1,22.1,22.1,22.1,22.1,22.1,22.1,22.1,22.1,22.1,22.1,22.1,22.1,22.1,22.1,22.1,22.1,22.1,22.1,22.1,22.1,22.1,22.1,22.1,{"$f":"ROUND(BO55*BO41*$B$33,1)","v":22.1},22.1,22.1,22.1,22.1,22.1,22.1,22.1,22.1,22.1,22.1,22.1,22.1,22.1,22.1,22.1,22.1,22.1,22.1,22.1,22.1,22.1,22.1,22.1,22.1,22.1,22.1,22.1,22.1,22.1,22.1,22.1,22.1,22.1,22.1,22.1,22.1,22.1,22.1,22.1,22.1,22.1,22.1,22.1,22.1,22.1,22.1,22.1,22.1,22.1,22.1,22.1,22.1,22.1,22.1]
[]
["Total DL Overhead time / frame (usec) (w/o MAC OH)",{"$f":"Input!$B$54+SUM(B81:B84)","v":152},{"$f":"Input!$B$54+SUM(C81:C84)","v":226},{"$f":"Input!$B$54+SUM(D81:D84)","v":299},{"$f":"Input!$B$54+SUM(E81:E84)","v":373},{"$f":"Input!$B$54+SUM(F81:F84)","v":446},{"$f":"Input!$B$54+SUM(G81:G84)","v":520},{"$f":"Input!$B$54+SUM(H81:H84)","v":593},{"$f":"Input!$B$54+SUM(I81:I84)","v":667},{"$f":"Input!$B$54+SUM(J81:J84)","v":682},{"$f":"Input!$B$54+SUM(K81:K84)","v":682},{"$f":"Input!$B$54+SUM(L81:L84)","v":682},{"$f":"Input!$B$54+SUM(M81:M84)","v":682},{"$f":"Input!$B$54+SUM(N81:N84)","v":682},{"$f":"Input!$B$54+SUM(O81:O84)","v":682},{"$f":"Input!$B$54+SUM(P81:P84)","v":682},{"$f":"Input!$B$54+SUM(Q81:Q84)","v":682},{"$f":"Input!$B$54+SUM(R81:R84)","v":682},{"$f":"Input!$B$54+SUM(S81:S84)","v":682},{"$f":"Input!$B$54+SUM(T81:T84)","v":682},{"$f":"Input!$B$54+SUM(U81:U84)","v":682},{"$f":"Input!$B$54+SUM(V81:V84)","v":682},{"$f":"Input!$B$54+SUM(W81:W84)","v":682},{"$f":"Input!$B$54+SUM(X81:X84)","v":682},{"$f":"Input!$B$54+SUM(Y81:Y84)","v":682},{"$f":"Input!$B$54+SUM(Z81:Z84)","v":682},{"$f":"Input!$B$54+SUM(AA81:AA84)","v":682},{"$f":"Input!$B$54+SUM(AB81:AB84)","v":682},{"$f":"Input!$B$54+SUM(AC81:AC84)","v":682},{"$f":"Input!$B$54+SUM(AD81:AD84)","v":682},{"$f":"Input!$B$54+SUM(AE81:AE84)","v":682},{"$f":"Input!$B$54+SUM(AF81:AF84)","v":682},{"$f":"Input!$B$54+SUM(AG81:AG84)","v":682},{"$f":"Input!$B$54+SUM(AH81:AH84)","v":682},{"$f":"Input!$B$54+SUM(AI81:AI84)","v":682},{"$f":"Input!$B$54+SUM(AJ81:AJ84)","v":682},{"$f":"Input!$B$54+SUM(AK81:AK84)","v":682},{"$f":"Input!$B$54+SUM(AL81:AL84)","v":682},{"$f":"Input!$B$54+SUM(AM81:AM84)","v":682},{"$f":"Input!$B$54+SUM(AN81:AN84)","v":682},{"$f":"Input!$B$54+SUM(AO81:AO84)","v":682},{"$f":"Input!$B$54+SUM(AP81:AP84)","v":682},{"$f":"Input!$B$54+SUM(AQ81:AQ84)","v":682},{"$f":"Input!$B$54+SUM(AR81:AR84)","v":682},{"$f":"Input!$B$54+SUM(AS81:AS84)","v":682},{"$f":"Input!$B$54+SUM(AT81:AT84)","v":682},{"$f":"Input!$B$54+SUM(AU81:AU84)","v":682},{"$f":"Input!$B$54+SUM(AV81:AV84)","v":682},{"$f":"Input!$B$54+SUM(AW81:AW84)","v":682},{"$f":"Input!$B$54+SUM(AX81:AX84)","v":682},{"$f":"Input!$B$54+SUM(AY81:AY84)","v":682},{"$f":"Input!$B$54+SUM(AZ81:AZ84)","v":682},{"$f":"Input!$B$54+SUM(BA81:BA84)","v":682},{"$f":"Input!$B$54+SUM(BB81:BB84)","v":682},{"$f":"Input!$B$54+SUM(BC81:BC84)","v":682},{"$f":"Input!$B$54+SUM(BD81:BD84)","v":682},{"$f":"Input!$B$54+SUM(BE81:BE84)","v":682},{"$f":"Input!$B$54+SUM(BF81:BF84)","v":682},{"$f":"Input!$B$54+SUM(BG81:BG84)","v":682},{"$f":"Input!$B$54+SUM(BH81:BH84)","v":682},{"$f":"Input!$B$54+SUM(BI81:BI84)","v":682},{"$f":"Input!$B$54+SUM(BJ81:BJ84)","v":682},{"$f":"Input!$B$54+SUM(BK81:BK84)","v":682},{"$f":"Input!$B$54+SUM(BL81:BL84)","v":682},{"$f":"Input!$B$54+SUM(BM81:BM84)","v":682},{"$f":"Input!$B$54+SUM(BN81:BN84)","v":682},{"$f":"Input!$B$54+SUM(BO81:BO84)","v":682},{"$f":"Input!$B$54+SUM(BP81:BP84)","v":682},{"$f":"Input!$B$54+SUM(BQ81:BQ84)","v":682},{"$f":"Input!$B$54+SUM(BR81:BR84)","v":682},{"$f":"Input!$B$54+SUM(BS81:BS84)","v":682},{"$f":"Input!$B$54+SUM(BT81:BT84)","v":682},{"$f":"Input!$B$54+SUM(BU81:BU84)","v":682},{"$f":"Input!$B$54+SUM(BV81:BV84)","v":682},{"$f":"Input!$B$54+SUM(BW81:BW84)","v":682},{"$f":"Input!$B$54+SUM(BX81:BX84)","v":682},{"$f":"Input!$B$54+SUM(BY81:BY84)","v":682},{"$f":"Input!$B$54+SUM(BZ81:BZ84)","v":682},{"$f":"Input!$B$54+SUM(CA81:CA84)","v":682},{"$f":"Input!$B$54+SUM(CB81:CB84)","v":682},{"$f":"Input!$B$54+SUM(CC81:CC84)","v":682},{"$f":"Input!$B$54+SUM(CD81:CD84)","v":682},{"$f":"Input!$B$54+SUM(CE81:CE84)","v":682},{"$f":"Input!$B$54+SUM(CF81:CF84)","v":682},{"$f":"Input!$B$54+SUM(CG81:CG84)","v":682},{"$f":"Input!$B$54+SUM(CH81:CH84)","v":682},{"$f":"Input!$B$54+SUM(CI81:CI84)","v":682},{"$f":"Input!$B$54+SUM(CJ81:CJ84)","v":682},{"$f":"Input!$B$54+SUM(CK81:CK84)","v":682},{"$f":"Input!$B$54+SUM(CL81:CL84)","v":682},{"$f":"Input!$B$54+SUM(CM81:CM84)","v":682},{"$f":"Input!$B$54+SUM(CN81:CN84)","v":682},{"$f":"Input!$B$54+SUM(CO81:CO84)","v":682},{"$f":"Input!$B$54+SUM(CP81:CP84)","v":682},{"$f":"Input!$B$54+SUM(CQ81:CQ84)","v":682},{"$f":"Input!$B$54+SUM(CR81:CR84)","v":682},{"$f":"Input!$B$54+SUM(CS81:CS84)","v":682},{"$f":"Input!$B$54+SUM(CT81:CT84)","v":682},{"$f":"Input!$B$54+SUM(CU81:CU84)","v":682},{"$f":"Input!$B$54+SUM(CV81:CV84)","v":682},{"$f":"Input!$B$54+SUM(CW81:CW84)","v":682},{"$f":"Input!$B$54+SUM(CX81:CX84)","v":682},{"$f":"Input!$B$54+SUM(CY81:CY84)","v":682},{"$f":"Input!$B$54+SUM(CZ81:CZ84)","v":682},{"$f":"Input!$B$54+SUM(DA81:DA84)","v":682},{"$f":"Input!$B$54+SUM(DB81:DB84)","v":682},{"$f":"Input!$B$54+SUM(DC81:DC84)","v":682},{"$f":"Input!$B$54+SUM(DD81:DD84)","v":682},{"$f":"Input!$B$54+SUM(DE81:DE84)","v":682},{"$f":"Input!$B$54+SUM(DF81:DF84)","v":682},{"$f":"Input!$B$54+SUM(DG81:DG84)","v":682},{"$f":"Input!$B$54+SUM(DH81:DH84)","v":682},{"$f":"Input!$B$54+SUM(DI81:DI84)","v":682},{"$f":"Input!$B$54+SUM(DJ81:DJ84)","v":682},{"$f":"Input!$B$54+SUM(DK81:DK84)","v":682},{"$f":"Input!$B$54+SUM(DL81:DL84)","v":682},{"$f":"Input!$B$54+SUM(DM81:DM84)","v":682},{"$f":"Input!$B$54+SUM(DN81:DN84)","v":682},{"$f":"Input!$B$54+SUM(DO81:DO84)","v":682},{"$f":"Input!$B$54+SUM(DP81:DP84)","v":682},{"$f":"Input!$B$54+SUM(DQ81:DQ84)","v":682}]
[]
["UL Preamble Overhead time / frame (usec)",{"$f":"B41*$B$8","v":36},{"$f":"C41*$B$8","v":72},108,144,180,216,252,288,324,324,324,324,324,324,324,324,324,324,324,324,324,324,324,324,324,324,324,324,324,324,324,324,324,324,324,324,324,324,324,324,324,324,324,324,324,324,324,324,324,324,324,324,324,324,324,324,324,324,324,324,324,324,324,324,324,{"$f":"BO41*$B$8","v":324},324,324,324,324,324,324,324,324,324,324,324,324,324,324,324,324,324,324,324,324,324,324,324,324,324,324,324,324,324,324,324,324,324,324,324,324,324,324,324,324,324,324,324,324,324,324,324,324,324,324,324,324,324,324]
["UL Inter-STA Transmission Overhead Time / frame (usec)",{"$f":"(B41-1)*$B$21","v":0},{"$f":"(C41-1)*$B$21","v":10},20,30,40,50,60,70,80,80,80,80,80,80,80,80,80,80,80,80,80,80,80,80,80,80,80,80,80,80,80,80,80,80,80,80,80,80,80,80,80,80,80,80,80,80,80,80,80,80,80,80,80,80,80,80,80,80,80,80,80,80,80,80,80,{"$f":"(BO41-1)*$B$21","v":80},80,80,80,80,80,80,80,80,80,80,80,80,80,80,80,80,80,80,80,80,80,80,80,80,80,80,80,80,80,80,80,80,80,80,80,80,80,80,80,80,80,80,80,80,80,80,80,80,80,80,80,80,80,80]
["UL Inter-MPDU Spacing  Overhead Time/ frame (usec)",{"$f":"B41*ROUNDUP(B54,0)*$B$18","v":0},{"$f":"C41*ROUNDUP(C55,0)*$B$18","v":0},0,0,0,0,0,0,0,0,0,0,0,0,0,0,0,0,0,0,0,0,0,0,0,0,0,0,0,0,0,0,0,0,0,0,0,0,0,0,0,0,0,0,0,0,0,0,0,0,0,0,0,0,0,0,0,0,0,0,0,0,0,0,0,{"$f":"BO41*ROUNDUP(BO55,0)*$B$18","v":0},0,0,0,0,0,0,0,0,0,0,0,0,0,0,0,0,0,0,0,0,0,0,0,0,0,0,0,0,0,0,0,0,0,0,0,0,0,0,0,0,0,0,0,0,0,0,0,0,0,0,0,0,0,0]
["UL MAC Management Overhead Time / frame (usec)",{"$f":"ROUND(B41*B54*$B$33,1)","v":59},{"$f":"ROUND(C41*C55*$B$33,1)","v":54.1},51.7,49.2,49.2,44.3,34.4,39.4,22.1,22.1,22.1,22.1,22.1,22.1,22.1,22.1,22.1,22.1,22.1,22.1,22.1,22.1,22.1,22.1,22.1,22.1,22.1,22.1,22.1,22.1,22.1,22.1,22.1,22.1,22.1,22.1,22.1,22.1,22.1,22.1,22.1,22.1,22.1,22.1,22.1,22.1,22.1,22.1,22.1,22.1,22.1,22.1,22.1,22.1,22.1,22.1,22.1,22.1,22.1,22.1,22.1,22.1,22.1,22.1,22.1,{"$f":"ROUND(BO41*BO55*$B$33,1)","v":22.1},22.1,22.1,22.1,22.1,22.1,22.1,22.1,22.1,22.1,22.1,22.1,22.1,22.1,22.1,22.1,22.1,22.1,22.1,22.1,22.1,22.1,22.1,22.1,22.1,22.1,22.1,22.1,22.1,22.1,22.1,22.1,22.1,22.1,22.1,22.1,22.1,22.1,22.1,22.1,22.1,22.1,22.1,22.1,22.1,22.1,22.1,22.1,22.1,22.1,22.1,22.1,22.1,22.1,22.1]
[]
["UL Overhead time / frame (usec) (w/o MAC OH)",{"$f":"Input!$B$53+SUM(B89:B91)","v":127},{"$f":"Input!$B$53+SUM(C89:C91)","v":173},{"$f":"Input!$B$53+SUM(D89:D91)","v":219},{"$f":"Input!$B$53+SUM(E89:E91)","v":265},{"$f":"Input!$B$53+SUM(F89:F91)","v":311},{"$f":"Input!$B$53+SUM(G89:G91)","v":357},{"$f":"Input!$B$53+SUM(H89:H91)","v":403},{"$f":"Input!$B$53+SUM(I89:I91)","v":449},{"$f":"Input!$B$53+SUM(J89:J91)","v":495},{"$f":"Input!$B$53+SUM(K89:K91)","v":495},{"$f":"Input!$B$53+SUM(L89:L91)","v":495},{"$f":"Input!$B$53+SUM(M89:M91)","v":495},{"$f":"Input!$B$53+SUM(N89:N91)","v":495},{"$f":"Input!$B$53+SUM(O89:O91)","v":495},{"$f":"Input!$B$53+SUM(P89:P91)","v":495},{"$f":"Input!$B$53+SUM(Q89:Q91)","v":495},{"$f":"Input!$B$53+SUM(R89:R91)","v":495},{"$f":"Input!$B$53+SUM(S89:S91)","v":495},{"$f":"Input!$B$53+SUM(T89:T91)","v":495},{"$f":"Input!$B$53+SUM(U89:U91)","v":495},{"$f":"Input!$B$53+SUM(V89:V91)","v":495},{"$f":"Input!$B$53+SUM(W89:W91)","v":495},{"$f":"Input!$B$53+SUM(X89:X91)","v":495},{"$f":"Input!$B$53+SUM(Y89:Y91)","v":495},{"$f":"Input!$B$53+SUM(Z89:Z91)","v":495},{"$f":"Input!$B$53+SUM(AA89:AA91)","v":495},{"$f":"Input!$B$53+SUM(AB89:AB91)","v":495},{"$f":"Input!$B$53+SUM(AC89:AC91)","v":495},{"$f":"Input!$B$53+SUM(AD89:AD91)","v":495},{"$f":"Input!$B$53+SUM(AE89:AE91)","v":495},{"$f":"Input!$B$53+SUM(AF89:AF91)","v":495},{"$f":"Input!$B$53+SUM(AG89:AG91)","v":495},{"$f":"Input!$B$53+SUM(AH89:AH91)","v":495},{"$f":"Input!$B$53+SUM(AI89:AI91)","v":495},{"$f":"Input!$B$53+SUM(AJ89:AJ91)","v":495},{"$f":"Input!$B$53+SUM(AK89:AK91)","v":495},{"$f":"Input!$B$53+SUM(AL89:AL91)","v":495},{"$f":"Input!$B$53+SUM(AM89:AM91)","v":495},{"$f":"Input!$B$53+SUM(AN89:AN91)","v":495},{"$f":"Input!$B$53+SUM(AO89:AO91)","v":495},{"$f":"Input!$B$53+SUM(AP89:AP91)","v":495},{"$f":"Input!$B$53+SUM(AQ89:AQ91)","v":495},{"$f":"Input!$B$53+SUM(AR89:AR91)","v":495},{"$f":"Input!$B$53+SUM(AS89:AS91)","v":495},{"$f":"Input!$B$53+SUM(AT89:AT91)","v":495},{"$f":"Input!$B$53+SUM(AU89:AU91)","v":495},{"$f":"Input!$B$53+SUM(AV89:AV91)","v":495},{"$f":"Input!$B$53+SUM(AW89:AW91)","v":495},{"$f":"Input!$B$53+SUM(AX89:AX91)","v":495},{"$f":"Input!$B$53+SUM(AY89:AY91)","v":495},{"$f":"Input!$B$53+SUM(AZ89:AZ91)","v":495},{"$f":"Input!$B$53+SUM(BA89:BA91)","v":495},{"$f":"Input!$B$53+SUM(BB89:BB91)","v":495},{"$f":"Input!$B$53+SUM(BC89:BC91)","v":495},{"$f":"Input!$B$53+SUM(BD89:BD91)","v":495},{"$f":"Input!$B$53+SUM(BE89:BE91)","v":495},{"$f":"Input!$B$53+SUM(BF89:BF91)","v":495},{"$f":"Input!$B$53+SUM(BG89:BG91)","v":495},{"$f":"Input!$B$53+SUM(BH89:BH91)","v":495},{"$f":"Input!$B$53+SUM(BI89:BI91)","v":495},{"$f":"Input!$B$53+SUM(BJ89:BJ91)","v":495},{"$f":"Input!$B$53+SUM(BK89:BK91)","v":495},{"$f":"Input!$B$53+SUM(BL89:BL91)","v":495},{"$f":"Input!$B$53+SUM(BM89:BM91)","v":495},{"$f":"Input!$B$53+SUM(BN89:BN91)","v":495},{"$f":"Input!$B$53+SUM(BO89:BO91)","v":495},{"$f":"Input!$B$53+SUM(BP89:BP91)","v":495},{"$f":"Input!$B$53+SUM(BQ89:BQ91)","v":495},{"$f":"Input!$B$53+SUM(BR89:BR91)","v":495},{"$f":"Input!$B$53+SUM(BS89:BS91)","v":495},{"$f":"Input!$B$53+SUM(BT89:BT91)","v":495},{"$f":"Input!$B$53+SUM(BU89:BU91)","v":495},{"$f":"Input!$B$53+SUM(BV89:BV91)","v":495},{"$f":"Input!$B$53+SUM(BW89:BW91)","v":495},{"$f":"Input!$B$53+SUM(BX89:BX91)","v":495},{"$f":"Input!$B$53+SUM(BY89:BY91)","v":495},{"$f":"Input!$B$53+SUM(BZ89:BZ91)","v":495},{"$f":"Input!$B$53+SUM(CA89:CA91)","v":495},{"$f":"Input!$B$53+SUM(CB89:CB91)","v":495},{"$f":"Input!$B$53+SUM(CC89:CC91)","v":495},{"$f":"Input!$B$53+SUM(CD89:CD91)","v":495},{"$f":"Input!$B$53+SUM(CE89:CE91)","v":495},{"$f":"Input!$B$53+SUM(CF89:CF91)","v":495},{"$f":"Input!$B$53+SUM(CG89:CG91)","v":495},{"$f":"Input!$B$53+SUM(CH89:CH91)","v":495},{"$f":"Input!$B$53+SUM(CI89:CI91)","v":495},{"$f":"Input!$B$53+SUM(CJ89:CJ91)","v":495},{"$f":"Input!$B$53+SUM(CK89:CK91)","v":495},{"$f":"Input!$B$53+SUM(CL89:CL91)","v":495},{"$f":"Input!$B$53+SUM(CM89:CM91)","v":495},{"$f":"Input!$B$53+SUM(CN89:CN91)","v":495},{"$f":"Input!$B$53+SUM(CO89:CO91)","v":495},{"$f":"Input!$B$53+SUM(CP89:CP91)","v":495},{"$f":"Input!$B$53+SUM(CQ89:CQ91)","v":495},{"$f":"Input!$B$53+SUM(CR89:CR91)","v":495},{"$f":"Input!$B$53+SUM(CS89:CS91)","v":495},{"$f":"Input!$B$53+SUM(CT89:CT91)","v":495},{"$f":"Input!$B$53+SUM(CU89:CU91)","v":495},{"$f":"Input!$B$53+SUM(CV89:CV91)","v":495},{"$f":"Input!$B$53+SUM(CW89:CW91)","v":495},{"$f":"Input!$B$53+SUM(CX89:CX91)","v":495},{"$f":"Input!$B$53+SUM(CY89:CY91)","v":495},{"$f":"Input!$B$53+SUM(CZ89:CZ91)","v":495},{"$f":"Input!$B$53+SUM(DA89:DA91)","v":495},{"$f":"Input!$B$53+SUM(DB89:DB91)","v":495},{"$f":"Input!$B$53+SUM(DC89:DC91)","v":495},{"$f":"Input!$B$53+SUM(DD89:DD91)","v":495},{"$f":"Input!$B$53+SUM(DE89:DE91)","v":495},{"$f":"Input!$B$53+SUM(DF89:DF91)","v":495},{"$f":"Input!$B$53+SUM(DG89:DG91)","v":495},{"$f":"Input!$B$53+SUM(DH89:DH91)","v":495},{"$f":"Input!$B$53+SUM(DI89:DI91)","v":495},{"$f":"Input!$B$53+SUM(DJ89:DJ91)","v":495},{"$f":"Input!$B$53+SUM(DK89:DK91)","v":495},{"$f":"Input!$B$53+SUM(DL89:DL91)","v":495},{"$f":"Input!$B$53+SUM(DM89:DM91)","v":495},{"$f":"Input!$B$53+SUM(DN89:DN91)","v":495},{"$f":"Input!$B$53+SUM(DO89:DO91)","v":495},{"$f":"Input!$B$53+SUM(DP89:DP91)","v":495},{"$f":"Input!$B$53+SUM(DQ89:DQ91)","v":495}]
[]
["Total Overhead time / frame (usec)",{"$f":" B87+B94","v":279},{"$f":" C87+C94","v":399},518,638,757,877,996,1116,1177,1177,1177,1177,1177,1177,1177,1177,1177,1177,1177,1177,1177,1177,1177,1177,1177,1177,1177,1177,1177,1177,1177,1177,1177,1177,1177,1177,1177,1177,1177,1177,1177,1177,1177,1177,1177,1177,1177,1177,1177,1177,1177,1177,1177,1177,1177,1177,1177,1177,1177,1177,1177,1177,1177,1177,1177,{"$f":" BO87+BO94","v":1177},1177,1177,1177,1177,1177,1177,1177,1177,1177,1177,1177,1177,1177,1177,1177,1177,1177,1177,1177,1177,1177,1177,1177,1177,1177,1177,1177,1177,1177,1177,1177,1177,1177,1177,1177,1177,1177,1177,1177,1177,1177,1177,1177,1177,1177,1177,1177,1177,1177,1177,1177,1177,1177,1177]
["% Overhead Time",{"$f":"B96/1000/$B$1","v":5.5800000000000002E-2},{"$f":"C96/1000/$B$1","v":7.980000000000001E-2},0.1036,0.12759999999999999,0.15140000000000001,0.1754,0.19919999999999999,0.22320000000000001,0.2354,0.2354,0.2354,0.2354,0.2354,0.2354,0.2354,0.2354,0.2354,0.2354,0.2354,0.2354,0.2354,0.2354,0.2354,0.2354,0.2354,0.2354,0.2354,0.2354,0.2354,0.2354,0.2354,0.2354,0.2354,0.2354,0.2354,0.2354,0.2354,0.2354,0.2354,0.2354,0.2354,0.2354,0.2354,0.2354,0.2354,0.2354,0.2354,0.2354,0.2354,0.2354,0.2354,0.2354,0.2354,0.2354,0.2354,0.2354,0.2354,0.2354,0.2354,0.2354,0.2354,0.2354,0.2354,0.2354,0.2354,{"$f":"BO96/1000/$B$1","v":0.2354},0.2354,0.2354,0.2354,0.2354,0.2354,0.2354,0.2354,0.2354,0.2354,0.2354,0.2354,0.2354,0.2354,0.2354,0.2354,0.2354,0.2354,0.2354,0.2354,0.2354,0.2354,0.2354,0.2354,0.2354,0.2354,0.2354,0.2354,0.2354,0.2354,0.2354,0.2354,0.2354,0.2354,0.2354,0.2354,0.2354,0.2354,0.2354,0.2354,0.2354,0.2354,0.2354,0.2354,0.2354,0.2354,0.2354,0.2354,0.2354,0.2354,0.2354,0.2354,0.2354,0.2354,0.2354]
[]
["DL Overhead Time / Sec (msec)",{"$f":"B87*$B$9/1000","v":30.4},{"$f":"C87*$B$9/1000","v":45.2},59.8,74.599999999999994,89.2,104,118.6,133.4,136.4,136.4,136.4,136.4,136.4,136.4,136.4,136.4,136.4,136.4,136.4,136.4,136.4,136.4,136.4,136.4,136.4,136.4,136.4,136.4,136.4,136.4,136.4,136.4,136.4,136.4,136.4,136.4,136.4,136.4,136.4,136.4,136.4,136.4,136.4,136.4,136.4,136.4,136.4,136.4,136.4,136.4,136.4,136.4,136.4,136.4,136.4,136.4,136.4,136.4,136.4,136.4,136.4,136.4,136.4,136.4,136.4,{"$f":"BO87*$B$9/1000","v":136.4},136.4,136.4,136.4,136.4,136.4,136.4,136.4,136.4,136.4,136.4,136.4,136.4,136.4,136.4,136.4,136.4,136.4,136.4,136.4,136.4,136.4,136.4,136.4,136.4,136.4,136.4,136.4,136.4,136.4,136.4,136.4,136.4,136.4,136.4,136.4,136.4,136.4,136.4,136.4,136.4,136.4,136.4,136.4,136.4,136.4,136.4,136.4,136.4,136.4,136.4,136.4,136.4,136.4,136.4]
["UL Overhead Time / Sec (msec)",{"$f":"B94*$B$9/1000","v":25.4},{"$f":"C94*$B$9/1000","v":34.6},43.8,53,62.2,71.400000000000006,80.599999999999994,89.8,99,99,99,99,99,99,99,99,99,99,99,99,99,99,99,99,99,99,99,99,99,99,99,99,99,99,99,99,99,99,99,99,99,99,99,99,99,99,99,99,99,99,99,99,99,99,99,99,99,99,99,99,99,99,99,99,99,{"$f":"BO94*$B$9/1000","v":99},99,99,99,99,99,99,99,99,99,99,99,99,99,99,99,99,99,99,99,99,99,99,99,99,99,99,99,99,99,99,99,99,99,99,99,99,99,99,99,99,99,99,99,99,99,99,99,99,99,99,99,99,99,99]
["Total Overhead time / Sec (msec)",{"$f":"B99+B100","v":55.8},{"$f":"C99+C100","v":79.800000000000011},103.6,127.6,151.4,175.4,199.2,223.2,235.4,235.4,235.4,235.4,235.4,235.4,235.4,235.4,235.4,235.4,235.4,235.4,235.4,235.4,235.4,235.4,235.4,235.4,235.4,235.4,235.4,235.4,235.4,235.4,235.4,235.4,235.4,235.4,235.4,235.4,235.4,235.4,235.4,235.4,235.4,235.4,235.4,235.4,235.4,235.4,235.4,235.4,235.4,235.4,235.4,235.4,235.4,235.4,235.4,235.4,235.4,235.4,235.4,235.4,235.4,235.4,235.4,{"$f":"BO99+BO100","v":235.4},235.4,235.4,235.4,235.4,235.4,235.4,235.4,235.4,235.4,235.4,235.4,235.4,235.4,235.4,235.4,235.4,235.4,235.4,235.4,235.4,235.4,235.4,235.4,235.4,235.4,235.4,235.4,235.4,235.4,235.4,235.4,235.4,235.4,235.4,235.4,235.4,235.4,235.4,235.4,235.4,235.4,235.4,235.4,235.4,235.4,235.4,235.4,235.4,235.4,235.4,235.4,235.4,235.4,235.4]
["% Overhead Time/Sec",{"$f":"B101/1000","v":5.5799999999999995E-2},{"$f":"C101/1000","v":7.980000000000001E-2},0.1036,0.12759999999999999,0.15140000000000001,0.1754,0.19919999999999999,0.22319999999999998,0.2354,0.2354,0.2354,0.2354,0.2354,0.2354,0.2354,0.2354,0.2354,0.2354,0.2354,0.2354,0.2354,0.2354,0.2354,0.2354,0.2354,0.2354,0.2354,0.2354,0.2354,0.2354,0.2354,0.2354,0.2354,0.2354,0.2354,0.2354,0.2354,0.2354,0.2354,0.2354,0.2354,0.2354,0.2354,0.2354,0.2354,0.2354,0.2354,0.2354,0.2354,0.2354,0.2354,0.2354,0.2354,0.2354,0.2354,0.2354,0.2354,0.2354,0.2354,0.2354,0.2354,0.2354,0.2354,0.2354,0.2354,{"$f":"BO101/1000","v":0.2354},0.2354,0.2354,0.2354,0.2354,0.2354,0.2354,0.2354,0.2354,0.2354,0.2354,0.2354,0.2354,0.2354,0.2354,0.2354,0.2354,0.2354,0.2354,0.2354,0.2354,0.2354,0.2354,0.2354,0.2354,0.2354,0.2354,0.2354,0.2354,0.2354,0.2354,0.2354,0.2354,0.2354,0.2354,0.2354,0.2354,0.2354,0.2354,0.2354,0.2354,0.2354,0.2354,0.2354,0.2354,0.2354,0.2354,0.2354,0.2354,0.2354,0.2354,0.2354,0.2354,0.2354,0.2354]

{"sheet":"LookupTab","index":7,"n_rows":90,"n_cols":16,"rows_kept":90,"cut":false,"hidden":true,"merged":[[36,3,36,6],[7,3,7,6],[7,12,7,15],[22,3,22,6],[22,11,22,14],[24,8,24,10]]}
[]
[null,null,null,null,"Time (usec)"]
[null,null,null,"RTTG",{"$f":"Input!B54","v":37}]
[null,null,null,"TTRG",{"$f":"Input!B53","v":91}]
[null,null,null,"PD(cs)",{"$f":"ROUNDUP(Input!B52,0)","v":54}]
[]
[]
[null,null,null,"2.5 msec",null,null,null,null,"MCS","20 MHz (b/s)","40 MHz (b/s)",null,"Num STAs Scheduled for Traffic in UL"]
[null,null,null,"TDD Ratio",null,"DL Useable Time","UL Useable Time",null,"MCS1",52,108,null,"TDd Ratio","UL STAs (2.5 msec)","UL STAs (5 msec)","UL STAs (10 msec)"]
[null,null,null,"95/5",0.95,{"$f":"$E10*2500 - $E$4 + $E$5","v":2338},{"$f":"(1-$E10)*2500 - $E$3 - $E$5","v":34.000000000000114},null,"MCS2",78,162,null,"95/5",1,1,2]
[null,null,null,"90/10",0.9,{"$f":"$E11*2500 - $E$4 + $E$5","v":2213},{"$f":"(1-$E11)*2500 - $E$3 - $E$5","v":158.99999999999994},null,"MCS3",104,216,null,"90/10",1,1,2]
[null,null,null,"85/15",0.85,2088,284.00000000000006,null,"MCS4",156,324,null,"85/15",1,1,3]
[null,null,null,"80/20",0.8,1963,408.99999999999989,null,"MCS5",208,432,null,"80/20",1,2,5]
[null,null,null,"75/25",0.75,1838,534,null,"MCS6",234,486,null,"75/25",1,3,6]
[null,null,null,"50/50",0.5,1213,1159,null,"MCS7",260,540,null,"50/50",4,9,18]
[null,null,null,"30/70",0.3,713,1659,null,"MCS9",104,216,null,"30/70",7,15,30]
[null,null,null,"10/90",0.1,213,2159,null,"MCS10",156,324,null,"10/90",8,17,34]
[null,null,null,"5/95",0.05,88,2284,null,"MCS11",208,432,null,"5/95",9,18,36]
[null,null,null,null,null,null,null,null,"MCS12",312,648]
[null,null,null,null,null,null,null,null,"MCS13",416,864]
[null,null,null,null,null,null,null,null,"MCS14",468,972]
[null,null,null,null,null,null,null,null,"MCS15",520,1080]
[null,null,null,"5 msec"]
[null,null,null,"TDD Ratio",null,"DL Useable Time","UL Useable Time"]
[null,null,null,"95/5",0.95,{"$f":"$E25*5000 - $E$4 + $E$5","v":4713},{"$f":"(1-$E25)*5000 - $E$3 -  $E$5","v":159.00000000000023},null,"CPU PPF (DL ONLY)"]
[null,null,null,"90/10",0.9,{"$f":"$E26*5000 - $E$4 + $E$5","v":4463},{"$f":"(1-$E26)*5000 - $E$3 -  $E$5","v":408.99999999999989},null,"Frame Duration","TDd Ratio","PPF"]
[null,null,null,"85/15",0.85,4213,659.00000000000011,null,2.5,"50/50",100]
[null,null,null,"80/20",0.8,3963,908.99999999999977,null,5,"50/50",200]
[null,null,null,"75/25",0.75,3713,1159,null,10,"50/50",400]
[null,null,null,"50/50",0.5,2463,2409]
[null,null,null,"30/70",0.3,1463,3409]
[null,null,null,"10/90",0.1,463,4409]
[null,null,null,"5/95",0.05,213,4659]
[]
[]
[]
[null,null,null,"10 msec"]
[null,null,null,"TDD Ratio",null,"DL Useable Time","UL Useable Time"]
[null,null,null,"95/5",0.95,{"$f":"$E39*10000 - $E$4 + $E$5","v":9463},{"$f":"(1-$E39)*10000 - $E$3 - $E$5","v":409.00000000000045}]
[null,null,null,"90/10",0.9,{"$f":"$E40*10000 - $E$4 + $E$5","v":8963},{"$f":"(1-$E40)*10000 - $E$3 - $E$5","v":908.99999999999977}]
[null,null,null,"85/15",0.85,8463,1409.0000000000002]
[null,null,null,"80/20",0.8,7963,1908.9999999999995]
[null,null,null,"75/25",0.75,7463,2409]
[null,null,null,"50/50",0.5,4963,4909]
[null,null,null,"30/70",0.3,2963,6909]
[null,null,null,"10/90",0.1,963,8909]
[null,null,null,"5/95",0.05,463,9409]
[]
[]
[null,null,null,null,null,null,null,"TLVs (STAs) in GPF","GPF Length (Bytes)","GPF Time(usec)"]
[null,null,null,null,null,null,null,1,{"$f":"Input!$B$40+H51*$E$56","v":52},{"$f":"ROUNDUP(Input!$B$15+(I51*8/(IF(Input!$B$3=20,52,108)))*4,0)","v":64}]
[null,null,null,null,null,null,null,2,{"$f":"Input!$B$40+H52*$E$56","v":76},{"$f":"ROUNDUP(Input!$B$15+(I52*8/(IF(Input!$B$3=20,52,108)))*4,0)","v":79}]
[null,null,null,null,null,null,null,3,{"$f":"Input!$B$40+H53*$E$56","v":100},{"$f":"ROUNDUP(Input!$B$15+(I53*8/(IF(Input!$B$3=20,52,108)))*4,0)","v":94}]
[null,null,null,"UL TXOP/ACK IE (Bytes)\nw/o ACK BITMAP",11,null,null,4,{"$f":"Input!$B$40+H54*$E$56","v":124},{"$f":"ROUNDUP(Input!$B$15+(I54*8/(IF(Input!$B$3=20,52,108)))*4,0)","v":109}]
[null,null,null,"ACK BITMAP Length (Bytes)",{"$f":"ROUNDUP(Input!B7/8,0)","v":13},null,null,5,{"$f":"Input!$B$40+H55*$E$56","v":148},{"$f":"ROUNDUP(Input!$B$15+(I55*8/(IF(Input!$B$3=20,52,108)))*4,0)","v":124}]
[null,null,null,"Total ULTXOP/ACK IE Length\n(Bytes)",{"$f":"SUM(E54:E55)","v":24},null,null,6,{"$f":"Input!$B$40+H56*$E$56","v":172},{"$f":"ROUNDUP(Input!$B$15+(I56*8/(IF(Input!$B$3=20,52,108)))*4,0)","v":138}]
[null,null,null,null,null,null,null,7,{"$f":"Input!$B$40+H57*$E$56","v":196},{"$f":"ROUNDUP(Input!$B$15+(I57*8/(IF(Input!$B$3=20,52,108)))*4,0)","v":153}]
[null,null,null,null,null,null,null,8,{"$f":"Input!$B$40+H58*$E$56","v":220},{"$f":"ROUNDUP(Input!$B$15+(I58*8/(IF(Input!$B$3=20,52,108)))*4,0)","v":168}]
[null,null,null,null,null,null,null,9,{"$f":"Input!$B$40+H59*$E$56","v":244},{"$f":"ROUNDUP(Input!$B$15+(I59*8/(IF(Input!$B$3=20,52,108)))*4,0)","v":183}]
[null,null,null,null,null,null,null,10,{"$f":"Input!$B$40+H60*$E$56","v":268},{"$f":"ROUNDUP(Input!$B$15+(I60*8/(IF(Input!$B$3=20,52,108)))*4,0)","v":197}]
[null,null,null,null,null,null,null,11,{"$f":"Input!$B$40+H61*$E$56","v":292},{"$f":"ROUNDUP(Input!$B$15+(I61*8/(IF(Input!$B$3=20,52,108)))*4,0)","v":212}]
[null,null,null,null,null,null,null,12,{"$f":"Input!$B$40+H62*$E$56","v":316},{"$f":"ROUNDUP(Input!$B$15+(I62*8/(IF(Input!$B$3=20,52,108)))*4,0)","v":227}]
[null,null,null,null,null,null,null,13,{"$f":"Input!$B$40+H63*$E$56","v":340},{"$f":"ROUNDUP(Input!$B$15+(I63*8/(IF(Input!$B$3=20,52,108)))*4,0)","v":242}]
[null,null,null,null,null,null,null,14,{"$f":"Input!$B$40+H64*$E$56","v":364},{"$f":"ROUNDUP(Input!$B$15+(I64*8/(IF(Input!$B$3=20,52,108)))*4,0)","v":256}]
[null,null,null,null,null,null,null,15,{"$f":"Input!$B$40+H65*$E$56","v":388},{"$f":"ROUNDUP(Input!$B$15+(I65*8/(IF(Input!$B$3=20,52,108)))*4,0)","v":271}]
[null,null,null,null,null,null,null,16,{"$f":"Input!$B$40+H66*$E$56","v":412},{"$f":"ROUNDUP(Input!$B$15+(I66*8/(IF(Input!$B$3=20,52,108)))*4,0)","v":286}]
[null,null,null,null,null,null,null,17,{"$f":"Input!$B$40+H67*$E$56","v":436},{"$f":"ROUNDUP(Input!$B$15+(I67*8/(IF(Input!$B$3=20,52,108)))*4,0)","v":301}]
[null,null,null,null,null,null,null,18,{"$f":"Input!$B$40+H68*$E$56","v":460},{"$f":"ROUNDUP(Input!$B$15+(I68*8/(IF(Input!$B$3=20,52,108)))*4,0)","v":316}]
[null,null,null,null,null,null,null,19,{"$f":"Input!$B$40+H69*$E$56","v":484},{"$f":"ROUNDUP(Input!$B$15+(I69*8/(IF(Input!$B$3=20,52,108)))*4,0)","v":330}]
[null,null,null,null,null,null,null,20,{"$f":"Input!$B$40+H70*$E$56","v":508},{"$f":"ROUNDUP(Input!$B$15+(I70*8/(IF(Input!$B$3=20,52,108)))*4,0)","v":345}]
[null,null,null,null,null,null,null,21,{"$f":"Input!$B$40+H71*$E$56","v":532},{"$f":"ROUNDUP(Input!$B$15+(I71*8/(IF(Input!$B$3=20,52,108)))*4,0)","v":360}]
[null,null,null,null,null,null,null,22,{"$f":"Input!$B$40+H72*$E$56","v":556},{"$f":"ROUNDUP(Input!$B$15+(I72*8/(IF(Input!$B$3=20,52,108)))*4,0)","v":375}]
[null,null,null,null,null,null,null,23,{"$f":"Input!$B$40+H73*$E$56","v":580},{"$f":"ROUNDUP(Input!$B$15+(I73*8/(IF(Input!$B$3=20,52,108)))*4,0)","v":389}]
[null,null,null,null,null,null,null,24,{"$f":"Input!$B$40+H74*$E$56","v":604},{"$f":"ROUNDUP(Input!$B$15+(I74*8/(IF(Input!$B$3=20,52,108)))*4,0)","v":404}]
[null,null,null,null,null,null,null,25,{"$f":"Input!$B$40+H75*$E$56","v":628},{"$f":"ROUNDUP(Input!$B$15+(I75*8/(IF(Input!$B$3=20,52,108)))*4,0)","v":419}]
[null,null,null,null,null,null,null,26,{"$f":"Input!$B$40+H76*$E$56","v":652},{"$f":"ROUNDUP(Input!$B$15+(I76*8/(IF(Input!$B$3=20,52,108)))*4,0)","v":434}]
[null,null,null,null,null,null,null,27,{"$f":"Input!$B$40+H77*$E$56","v":676},{"$f":"ROUNDUP(Input!$B$15+(I77*8/(IF(Input!$B$3=20,52,108)))*4,0)","v":448}]
[null,null,null,null,null,null,null,28,{"$f":"Input!$B$40+H78*$E$56","v":700},{"$f":"ROUNDUP(Input!$B$15+(I78*8/(IF(Input!$B$3=20,52,108)))*4,0)","v":463}]
[null,null,null,null,null,null,null,29,{"$f":"Input!$B$40+H79*$E$56","v":724},{"$f":"ROUNDUP(Input!$B$15+(I79*8/(IF(Input!$B$3=20,52,108)))*4,0)","v":478}]
[null,null,null,null,null,null,null,30,{"$f":"Input!$B$40+H80*$E$56","v":748},{"$f":"ROUNDUP(Input!$B$15+(I80*8/(IF(Input!$B$3=20,52,108)))*4,0)","v":493}]
[null,null,null,null,null,null,null,31,{"$f":"Input!$B$40+H81*$E$56","v":772},{"$f":"ROUNDUP(Input!$B$15+(I81*8/(IF(Input!$B$3=20,52,108)))*4,0)","v":508}]
[null,null,null,null,null,null,null,32,{"$f":"Input!$B$40+H82*$E$56","v":796},{"$f":"ROUNDUP(Input!$B$15+(I82*8/(IF(Input!$B$3=20,52,108)))*4,0)","v":522}]
[null,null,null,null,null,null,null,33,{"$f":"Input!$B$40+H83*$E$56","v":820},{"$f":"ROUNDUP(Input!$B$15+(I83*8/(IF(Input!$B$3=20,52,108)))*4,0)","v":537}]
[null,null,null,null,null,null,null,34,{"$f":"Input!$B$40+H84*$E$56","v":844},{"$f":"ROUNDUP(Input!$B$15+(I84*8/(IF(Input!$B$3=20,52,108)))*4,0)","v":552}]
[null,null,null,null,null,null,null,35,{"$f":"Input!$B$40+H85*$E$56","v":868},{"$f":"ROUNDUP(Input!$B$15+(I85*8/(IF(Input!$B$3=20,52,108)))*4,0)","v":567}]
[null,null,null,null,null,null,null,36,{"$f":"Input!$B$40+H86*$E$56","v":892},{"$f":"ROUNDUP(Input!$B$15+(I86*8/(IF(Input!$B$3=20,52,108)))*4,0)","v":581}]
[null,null,null,null,null,null,null,37,{"$f":"Input!$B$40+H87*$E$56","v":916},{"$f":"ROUNDUP(Input!$B$15+(I87*8/(IF(Input!$B$3=20,52,108)))*4,0)","v":596}]
[null,null,null,null,null,null,null,38,{"$f":"Input!$B$40+H88*$E$56","v":940},{"$f":"ROUNDUP(Input!$B$15+(I88*8/(IF(Input!$B$3=20,52,108)))*4,0)","v":611}]
[null,null,null,null,null,null,null,39,{"$f":"Input!$B$40+H89*$E$56","v":964},{"$f":"ROUNDUP(Input!$B$15+(I89*8/(IF(Input!$B$3=20,52,108)))*4,0)","v":626}]
[null,null,null,null,null,null,null,40,{"$f":"Input!$B$40+H90*$E$56","v":988},{"$f":"ROUNDUP(Input!$B$15+(I90*8/(IF(Input!$B$3=20,52,108)))*4,0)","v":640}]

{"sheet":"User Traffic Profile 1","index":8,"n_rows":128,"n_cols":6,"rows_kept":128,"cut":false,"hidden":true,"merged":[]}
[null,"% Active STAs \nPer Frame","Packet Size \n(Bytes)","Data Rate / STA\n(Mbps)","PPS / STA","Packet Interarrival \nTime (msec)"]
["Downlink",1,1500,10,{"$f":"D2*1024*1024/(8*C2)","v":873.81333333333339},{"$f":"(1/E2)*1000","v":1.1444091796875}]
["Uplink",1,400,2,{"$f":"D3*1024*1024/(8*C3)","v":655.36},{"$f":"(1/E3)*1000","v":1.52587890625}]
[]
[]
[]
[]
["Connected\nSTAs","Active DL \nSTAs/Frame","DL STAs Ready\nFor Scheduling /Frame","Active UL \nSTAs/Frame","UL STAs Ready\nFor Scheduling /Frame","Idle UL \nSTAs / Frame"]
[1,{"$f":"$B$2*A9","v":1},{"$f":"ROUNDUP(B9,0)","v":1},{"$f":"$B$3*A9","v":1},{"$f":"ROUNDUP(D9,0)","v":1},{"$f":"A9-E9","v":0}]
[2,2,{"$f":"ROUNDUP(B10,0)","v":2},2,2,{"$f":"A10-E10","v":0}]
[3,3,3,3,3,0]
[4,4,4,4,4,0]
[5,5,5,5,5,0]
[6,6,6,6,6,0]
[7,7,7,7,7,0]
[8,8,8,8,8,0]
[9,9,9,9,9,0]
[10,10,10,10,10,0]
[11,11,11,11,11,0]
[12,12,12,12,12,0]
[13,13,13,13,13,0]
[14,14,14,14,14,0]
[15,15,15,15,15,0]
[16,16,16,16,16,0]
[17,17,17,17,17,0]
[18,18,18,18,18,0]
[19,19,19,19,19,0]
[20,20,20,20,20,0]
[21,21,21,21,21,0]
[22,22,22,22,22,0]
[23,23,23,23,23,0]
[24,24,24,24,24,0]
[25,25,25,25,25,0]
[26,26,26,26,26,0]
[27,27,27,27,27,0]
[28,28,28,28,28,0]
[29,29,29,29,29,0]
[30,30,30,30,30,0]
[31,31,31,31,31,0]
[32,32,32,32,32,0]
[33,33,33,33,33,0]
[34,34,34,34,34,0]
[35,35,35,35,35,0]
[36,36,36,36,36,0]
[37,37,37,37,37,0]
[38,38,38,38,38,0]
[39,39,39,39,39,0]
[40,40,40,40,40,0]
[41,41,41,41,41,0]
[42,42,42,42,42,0]
[43,43,43,43,43,0]
[44,44,44,44,44,0]
[45,45,45,45,45,0]
[46,46,46,46,46,0]
[47,47,47,47,47,0]
[48,48,48,48,48,0]
[49,49,49,49,49,0]
[50,50,50,50,50,0]
[51,51,51,51,51,0]
[52,52,52,52,52,0]
[53,53,53,53,53,0]
[54,54,54,54,54,0]
[55,55,55,55,55,0]
[56,56,56,56,56,0]
[57,57,57,57,57,0]
[58,58,58,58,58,0]
[59,59,59,59,59,0]
[60,60,60,60,60,0]
[61,61,{"$f":"ROUNDUP(B69,0)","v":61},61,{"$f":"ROUNDUP(D69,0)","v":61},0]
[62,62,62,62,62,0]
[63,63,63,63,63,0]
[64,64,64,64,64,0]
[65,{"$f":"$B$2*A73","v":65},65,{"$f":"$B$3*A73","v":65},65,0]
[66,66,66,66,66,{"$f":"A74-E74","v":0}]
[67,67,67,67,67,0]
[68,68,68,68,68,0]
[69,69,69,69,69,0]
[70,70,70,70,70,0]
[71,71,71,71,71,0]
[72,72,72,72,72,0]
[73,73,73,73,73,0]
[74,74,74,74,74,0]
[75,75,75,75,75,0]
[76,76,76,76,76,0]
[77,77,77,77,77,0]
[78,78,78,78,78,0]
[79,79,79,79,79,0]
[80,80,80,80,80,0]
[81,81,81,81,81,0]
[82,82,82,82,82,0]
[83,83,83,83,83,0]
[84,84,84,84,84,0]
[85,85,85,85,85,0]
[86,86,86,86,86,0]
[87,87,87,87,87,0]
[88,88,88,88,88,0]
[89,89,89,89,89,0]
[90,90,90,90,90,0]
[91,91,91,91,91,0]
[92,92,92,92,92,0]
[93,93,93,93,93,0]
[94,94,94,94,94,0]
[95,95,95,95,95,0]
[96,96,96,96,96,0]
[97,97,97,97,97,0]
[98,98,98,98,98,0]
[99,99,99,99,99,0]
[100,100,100,100,100,0]
[101,101,101,101,101,0]
[102,102,102,102,102,0]
[103,103,103,103,103,0]
[104,104,104,104,104,0]
[105,105,105,105,105,0]
[106,106,106,106,106,0]
[107,107,107,107,107,0]
[108,108,108,108,108,0]
[109,109,109,109,109,0]
[110,110,110,110,110,0]
[111,111,111,111,111,0]
[112,112,112,112,112,0]
[113,113,113,113,113,0]
[114,114,114,114,114,0]
[115,115,115,115,115,0]
[116,116,116,116,116,0]
[117,117,117,117,117,0]
[118,118,118,118,118,0]
[119,119,119,119,119,0]
[120,120,120,120,120,0]