{"text_format":"1","workbook":"xlsx","n_sheets":9,"sheets":["Cover","Revision history","LINK BUDGET","Figures","Range","Input","UDP traffic","LookupTab","User Traffic Profile 1"],"not_rendered":{"charts":0,"images":4,"macros":1,"external_links":0,"defined_names":2,"comments":3,"pivot_tables":0},"unopened":[],"bounds":{"document_bytes":16777216,"sheet_cells":100000,"rows_first":2000,"rows_last":500,"rows_between":2000,"halvings":0,"cell_chars":16384,"cell_head_chars":4096},"cells_cut":0,"cells_raw":0,"read":"whole","date_system":"1904"}

{"sheet":"Cover","index":0,"n_rows":17,"n_cols":1,"rows_kept":17,"cut":false,"hidden":true,"merged":[]}
[]
[]
[]
[]
[]
[]
[]
[]
[]
[]
["ePMP System Release 1.0"]
["Link Budget Planning Results"]
[]
[]
[]
["Cambium Confidential Proprietary - for Engineering Use Only"]
["pmp-0436 \"ePMP System Release 1.0 Link Budget Planning Results\""]

{"sheet":"Revision history","index":1,"n_rows":7,"n_cols":3,"rows_kept":7,"cut":false,"hidden":true,"merged":[[0,2,0,3]]}
["Version","Date","Description"]
[0.1,"2013-08-23","Initial version covering R1.0"]
[0.2,"2013-09-06","Updated sensitivity values. Included Avenger throughput calculator."]
[0.3,"2013-09-25","Added CINR information and interference input; number of STAs up to 120; included updates to throughput calculator; added scheduling latency; updated antenna gains"]
[0.4,"2013-09-26","Changed STA antenna gain to 13 dBi and password protected spreadsheet"]
[0.5,"2013-09-26","This version shows only parameters available in release 1."]
[0.6,"2013-09-30","Updated frequency range, max center frequency and max power values for each band"]

{"sheet":"LINK BUDGET","index":2,"n_rows":69,"n_cols":16,"rows_kept":69,"cut":false,"hidden":false,"merged":[[14,2,14,3],[65,10,65,11],[66,10,66,11],[67,10,67,11],[65,4,65,5],[66,4,66,5],[67,4,67,5],[65,6,65,7],[66,6,66,7],[67,6,67,7],[65,8,65,9],[66,8,66,9],[67,8,67,9],[20,6,20,7],[43,4,43,5],[22,6,29,7],[1,1,1,11],[17,1,17,5],[20,4,20,5],[4,2,4,3],[39,4,39,5],[4,6,4,7],[8,6,8,7],[9,6,9,7],[5,5,5,7],[2,1,2,11],[18,6,18,7],[9,2,9,3],[10,6,10,7],[7,6,7,7],[22,1,29,1],[13,2,13,3],[38,4,38,5],[51,8,51,9],[39,10,39,11],[40,4,40,5],[41,4,41,5],[42,4,42,5],[47,4,47,5],[63,4,63,5],[64,4,64,5],[63,6,63,7],[64,6,64,7],[63,8,63,9],[8,2,8,3],[6,12,6,14],[3,1,3,11],[51,2,51,3],[20,10,20,11],[17,6,17,11],[6,5,6,7],[21,6,21,7],[46,4,46,5],[51,10,51,11],[51,4,51,7],[44,4,44,5],[45,4,45,5],[38,6,38,7],[39,6,39,7],[51,12,51,13],[60,8,60,9],[61,8,61,9],[62,8,62,9],[61,10,61,11],[3,12,5,14],[61,4,61,5],[62,4,62,5],[60,6,60,7],[61,6,61,7],[62,6,62,7],[30,1,37,1],[30,6,37,7],[56,14,56,15],[68,4,68,5],[68,6,68,7],[68,8,68,9],[68,10,68,11],[50,1,50,15],[60,10,60,11],[62,10,62,11],[64,10,64,11],[63,10,63,11],[64,8,64,9],[60,2,60,3],[51,14,51,15],[60,4,60,5]]}
[]
[null,"ePMP LINK BUDGET CALCULATOR"]
[null,"Cambium Networks confidential, not commercially binding"]
[null,"SYSTEM CONFIGURATION"]
[null,"Country","Others"]
[null,"Frequency band","5.7/5.8","[GHz]",null,"Lower frequency",null,null,{"$f":"Figures!B2*1000","v":5725},"[MHz]"]
[null,"Fade Margin",0,"[dB]",null,"Upper frequency",null,null,{"$f":"Figures!B3*1000","v":5875},"[MHz]"]
[null,"Channel Bandwidth",20,"[MHz]",null,null,"AP EIRP limit",null,{"$f":"Figures!B5","v":"-"},"[dBm]",{"$f":"IF(I8=\"-\",\"-\",ROUND((POWER(10,(I8/10)))/1000,1))","v":"-"},"[Watts]"]
[null,"AP antenna system","90° sector",null,null,null,"Max AP Tx Power",null,{"$f":"Figures!B4","v":23},"[dBm]",{"$f":"ROUND(POWER(10,(I9/10)),1)","v":199.5},"[mWatts]"]
[null,"Environment","rural",null,null,null,"STA EIRP limit",null,{"$f":"Figures!B6","v":"-"},"[dBm]",{"$f":"IF(I10=\"-\",\"-\",ROUND((POWER(10,(I10/10)))/1000,1))","v":"-"},"[Watts]"]
[null,"Max range",5,"[miles]",null,null,"Max STA Tx Power",null,{"$f":"Figures!B4","v":23},"[dBm]",{"$f":"ROUND(POWER(10,(I11/10)),1)","v":199.5},"[mWatts]"]
[null,"Max range limit",{"$f":"E60","v":15.912264293213822},"[miles]"]
[null,"Frame duration",5,"[ms]"]
[null,"Number of STAs/sector",20]
[null,"Duty cycle","50/50"]
[null,"UDP payload size",1472,"[bytes]"]
[null,"Interference level",0,"[dBm]"]
[null,"DOWNLINK BUDGET (AP to STA)",null,null,null,null,"UPLINK BUDGET (STA to AP)"]
[null,"AP Tx Power per chain",{"$f":"MIN(IF(I8=\"-\",20,MIN(20,I8-C21+C20-3)),I9-3)","v":20},"[dBm]",{"$f":"(POWER(10,(C19/10)))/1000","v":0.1},"[Watts]","STA Tx Power per chain",null,{"$f":"MIN(IF(I10=\"-\",20,MIN(20,I10-I21-3)),I11-3)","v":20},"[dBm]",{"$f":"(POWER(10,(I19/10)))/1000","v":0.1},"[Watts]"]
[null,"Cable Loss",1,"[dB]",{"$f":"(POWER(10,(C20/10)))/1000","v":1.2589254117941673E-3},"[Watts]"]
[null,"AP Antenna Gain",{"$f":"IF(C9=\"90° sector\",15,14)","v":15},"[dBi]",{"$f":"C9","v":"90° sector"},null,"STA Antenna Gain",null,{"$f":"C39","v":13},"[dBi]","Internal SM antenna"]
[null,"AP EIRP ",{"$f":"C19+3-C20+C21","v":37},"[dBm]",{"$f":"(POWER(10,(C22/10)))/1000","v":5.0118723362727327},"[Watts]","STA  EIRP ",null,{"$f":"I19+3+I21","v":36},"[dBm]",{"$f":"10^((I22-30)/10)","v":3.9810717055349727},"[Watts]"]
[null,"STA Rx Sensitivity ",{"$f":"Figures!I41","v":-68},"[dBm]","64QAM 5/6","MCS15","AP Rx Sensitivity ",null,{"$f":"Figures!H41","v":-70},"[dBm]","64QAM 5/6","MCS15"]
[null,null,{"$f":"Figures!I42","v":-70},"[dBm]","64QAM 3/4","MCS14",null,null,{"$f":"Figures!H42","v":-71},"[dBm]","64QAM 3/4","MCS14"]
[null,null,{"$f":"Figures!I43","v":-73},"[dBm]","64QAM 2/3","MCS13",null,null,{"$f":"Figures!H43","v":-73},"[dBm]","64QAM 2/3","MCS13"]
[null,null,{"$f":"Figures!I44","v":-77},"[dBm]","16QAM 3/4","MCS12",null,null,{"$f":"Figures!H44","v":-78},"[dBm]","16QAM 3/4","MCS12"]
[null,null,{"$f":"Figures!I45","v":-82},"[dBm]","16QAM 1/2","MCS11",null,null,{"$f":"Figures!H45","v":-81},"[dBm]","16QAM 1/2","MCS11"]
[null,null,{"$f":"Figures!I46","v":-83},"[dBm]","QPSK 3/4","MCS10",null,null,{"$f":"Figures!H46","v":-84},"[dBm]","QPSK 3/4","MCS10"]
[null,null,{"$f":"Figures!I47","v":-87},"[dBm]","QPSK 1/2","MCS9",null,null,{"$f":"Figures!H47","v":-86},"[dBm]","QPSK 1/2","MCS9"]
[null,null,{"$f":"Figures!I48","v":-90},"[dBm]","QPSK 1/2 SS","MCS1",null,null,{"$f":"Figures!H48","v":-89},"[dBm]","QPSK 1/2 SS","MCS1"]
{"$rows_left_out":40}
{"sheet":"Figures","index":3,"n_rows":59,"n_cols":10,"rows_kept":59,"cut":false,"hidden":true,"merged":[[18,1,18,3],[18,4,18,6],[28,1,28,3],[28,4,28,6]]}
["OUTPUTS",null,null,"Frequency band","Lower frequency","Upper frequency","Max center frequency","MAX Tx power FCC","MAX Tx power ETSI","MAX Tx power Others"]
["Lower Frequency:",{"$f":"VLOOKUP('LINK BUDGET'!C6,Figures!D2:F8,2)","v":5.7249999999999996},null,2.4,2.4119999999999999,2.472,"2460 (TBD)","23 (TBD)","(TBD)","23 (TBD)"]
["Upper Frequency:",{"$f":"VLOOKUP('LINK BUDGET'!C6,Figures!D2:F8,3)","v":5.875},null,5.0999999999999996,5.15,5.25,{"$f":"IF('LINK BUDGET'!C8=20,5240,5230)","v":5240},"X","X",18]
["Max Tx power:",{"$f":"IF('LINK BUDGET'!C5=\"Others\",VLOOKUP('LINK BUDGET'!C6,Figures!D2:J8,7),IF('LINK BUDGET'!C5=\"FCC\",VLOOKUP('LINK BUDGET'!C6,Figures!D2:J8,5),VLOOKUP('LINK BUDGET'!C6,Figures!D2:J8,6)))","v":23},null,5.2,5.25,5.35,{"$f":"IF('LINK BUDGET'!C5=\"FCC\",5320,5340)-IF('LINK BUDGET'!C8=20,0,10)","v":5340},{"$f":"IF('LINK BUDGET'!C8=20,12,13)","v":12},"X",18]
["AP EIRP limit:",{"$f":"VLOOKUP('LINK BUDGET'!C6,Figures!A21:H27,IF('LINK BUDGET'!C5=\"FCC\",4,IF('LINK BUDGET'!C5=\"ETSI\",7,8)))","v":"-"},null,"5.4 lower",5.47,5.55,{"$f":"IF('LINK BUDGET'!C8=20,5540,5530)","v":5540},10,"X","X"]
["STA EIRP limit: ",{"$f":"VLOOKUP('LINK BUDGET'!C6,Figures!A31:H37,IF('LINK BUDGET'!C5=\"FCC\",4,IF('LINK BUDGET'!C5=\"ETSI\",7,8)))","v":"-"},null,"5.4 upper",5.55,5.7249999999999996,{"$f":"IF('LINK BUDGET'!C8=20,5705,5695)","v":5705},13,"X","X"]
["Max center freq:",{"$f":"IF('LINK BUDGET'!C8=20,VLOOKUP('LINK BUDGET'!C6,Figures!D2:J8,4),VLOOKUP('LINK BUDGET'!C6,Figures!D2:J8,4)-10)","v":5865},null,5.4,5.47,5.7249999999999996,{"$f":"IF('LINK BUDGET'!C8=20,5715,5705)","v":5715},"X",15,19]
[null,null,null,"5.7/5.8",5.7249999999999996,{"$f":"IF('LINK BUDGET'!C5=\"FCC\",5.85,5.875)","v":5.875},{"$f":"IF('LINK BUDGET'!C5=\"FCC\",5835,5865)-IF('LINK BUDGET'!C8=20,0,10)","v":5865},23,23,23]
[]
[]
["Supported bands"]
["FCC","ETSI","Others"]
[2.4,2.4,2.4]
[5.2,5.4,5.0999999999999996]
["5.4 lower","5.7/5.8",5.2]
["5.4 upper",null,5.4]
["5.7/5.8",null,"5.7/5.8"]
[]
["AP EIRP limits","FCC",null,null,"ETSI",null,null,"Others"]
["Band","max EIRP","max density","EIRP limit","max EIRP","max density","EIRP limit","EIRP limit"]
[2.4,36,23,{"$f":"IF(B21=\"X\",\"X\",MIN(B21,C21+10*LOG10('LINK BUDGET'!$C$8)))","v":36},20,7,{"$f":"IF(E21=\"X\",\"X\",MIN(E21,F21+10*LOG10('LINK BUDGET'!$C$8)))","v":20},"-"]
[5.0999999999999996,"X","X",{"$f":"IF(B22=\"X\",\"X\",MIN(B22,C22+10*LOG10('LINK BUDGET'!$C$8)))","v":"X"},"X","X",{"$f":"IF(E22=\"X\",\"X\",MIN(E22,F22+10*LOG10('LINK BUDGET'!$C$8)))","v":"X"},"-"]
[5.2,30,10,{"$f":"IF(B23=\"X\",\"X\",MIN(B23,C23+10*LOG10('LINK BUDGET'!$C$8)))","v":23.010299956639813},"X","X",{"$f":"IF(E23=\"X\",\"X\",MIN(E23,F23+10*LOG10('LINK BUDGET'!$C$8)))","v":"X"},"-"]
[5.4,"X","X",{"$f":"IF(B24=\"X\",\"X\",MIN(B24,C24+10*LOG10('LINK BUDGET'!$C$8)))","v":"X"},30,17,{"$f":"IF(E24=\"X\",\"X\",MIN(E24,F24+10*LOG10('LINK BUDGET'!$C$8)))","v":30},"-"]
["5.4 lower",30,17,{"$f":"IF(B25=\"X\",\"X\",MIN(B25,C25+10*LOG10('LINK BUDGET'!$C$8)))","v":30},"X","X",{"$f":"IF(E25=\"X\",\"X\",MIN(E25,F25+10*LOG10('LINK BUDGET'!$C$8)))","v":"X"},"-"]
["5.4 upper",30,17,{"$f":"IF(B26=\"X\",\"X\",MIN(B26,C26+10*LOG10('LINK BUDGET'!$C$8)))","v":30},"X","X",{"$f":"IF(E26=\"X\",\"X\",MIN(E26,F26+10*LOG10('LINK BUDGET'!$C$8)))","v":"X"},"-"]
["5.7/5.8",36,23,{"$f":"IF(B27=\"X\",\"X\",MIN(B27,C27+10*LOG10('LINK BUDGET'!$C$8)))","v":36},36,23,{"$f":"IF(E27=\"X\",\"X\",MIN(E27,F27+10*LOG10('LINK BUDGET'!$C$8)))","v":36},"-"]
[]
["STA EIRP limits","FCC",null,null,"ETSI",null,null,"Others"]
["Band","max EIRP","max density","EIRP limit","max EIRP","max density","EIRP limit","EIRP limit"]
{"$rows_left_out":30}
{"sheet":"Range","index":4,"n_rows":17,"n_cols":6,"rows_kept":17,"cut":false,"hidden":true,"merged":[]}
["Frequency (MHz)",{"$f":"'LINK BUDGET'!C6","v":"5.7/5.8"}]
["Max center freq (MHz)",{"$f":"Figures!B7","v":5865}]
["Fade Margin (dB)",{"$f":"'LINK BUDGET'!C7","v":0}]
["Environment",{"$f":"'LINK BUDGET'!C10","v":"rural"}]
[]
["Free space path loss","Gain","Rural","Suburban","Urban","Output"]
[null,"dB","Range (miles)","Range (miles)","Range (miles)","Range (miles)"]
["Exponent",null,2,2.5,3]
[]
["Gain MCS15 (dB)",{"$f":"'LINK BUDGET'!C53","v":115},{"$f":"10^((B10-(20*LOG($B$2))-36.6-$B$3)/(10*$C$8))","v":1.418182047915892},{"$f":"10^((B10-(20*LOG($B$2))-36.6-$B$3)/(10*$D$8))","v":1.3224692628240329},{"$f":"10^((B10-(20*LOG($B$2))-36.6-$B$3)/(10*$E$8))","v":1.2622769613704616},{"$f":"IF($B$4=\"rural\",C10,IF($B$4=\"suburban\",D10,E10))","v":1.418182047915892}]
["Gain MCS14 (dB)",{"$f":"'LINK BUDGET'!C54","v":117},{"$f":"10^((B11-(20*LOG($B$2))-36.6-$B$3)/(10*$C$8))","v":1.7853854186716098},{"$f":"10^((B11-(20*LOG($B$2))-36.6-$B$3)/(10*$D$8))","v":1.5899577605680426},{"$f":"10^((B11-(20*LOG($B$2))-36.6-$B$3)/(10*$E$8))","v":1.4717068875393393},{"$f":"IF($B$4=\"rural\",C11,IF($B$4=\"suburban\",D11,E11))","v":1.7853854186716098}]
["Gain MCS13 (dB)",{"$f":"'LINK BUDGET'!C55","v":120},2.5219239354956637,2.0959725318888767,1.8527691994357747,2.5219239354956637]
["Gain MCS12 (dB)",{"$f":"'LINK BUDGET'!C56","v":124},3.9969800772718185,3.02960205598322,2.5185736520759101,3.9969800772718185]
["Gain MCS11 (dB)",{"$f":"'LINK BUDGET'!C57","v":128},6.3347865148708005,4.3791073012517758,3.4236391898476577,6.3347865148708005]
["Gain MCS10 (dB)",{"$f":"'LINK BUDGET'!C58","v":130},7.9750237218618594,5.2648449636684509,3.9916702358870357,7.9750237218618594]
["Gain MCS9 (dB)",{"$f":"'LINK BUDGET'!C59","v":133},11.26502042638697,6.940417350810697,5.0252150954606067,11.26502042638697]
["Gain MCS8 (dB)",{"$f":"'LINK BUDGET'!C60","v":136},15.912264293213822,9.1492519411000082,6.326370983407009,15.912264293213822]

{"sheet":"Input","index":5,"n_rows":62,"n_cols":7,"rows_kept":62,"cut":false,"hidden":true,"merged":[]}
["Frame duration (msec)",{"$f":"'LINK BUDGET'!C13","v":5},"←◊"]
["TDD Ratio",{"$f":"'LINK BUDGET'!C15","v":"50/50"},"←◊"]
["Channel Bandwdith (MHz)",{"$f":"'LINK BUDGET'!C8","v":20},"←◊"]
["Cell Radius (miles)",{"$f":"'LINK BUDGET'!C11","v":5},"←◊"]
["Overall CPU PPF (Packet Per Frame) Limit ",{"$f":"VLOOKUP(B1,LookupTab!I27:K29,3,FALSE)","v":200},null,null,null,null," "]
["CPU PPF (Packet Per Frame) Limit (DL based on TDD Ratio)",{"$f":"ROUNDUP(VLOOKUP(B2,LookupTab!D10:G18,2,FALSE)*Input!B5,0)","v":100}]
["CPU PPF (Packet Per Frame) Limit (UL based on TDD Ratio)",{"$f":"B5-B6","v":100}]
["MAX_CONTROL_OH",0.15,"←◊"]
["DL Users Scheduled / frame",{"$f":"ROUNDDOWN(B8*B45/(B14+B28),0)","v":8}]
["UL Users Scheduled / frame",{"$f":"VLOOKUP(B2,LookupTab!M10:P18,IF(Input!B1=2.5,2,IF(Input!B1=5,3,4)),FALSE)","v":9}]
[]
["MCS","MCS1","←◊"]
[]
["Data Peamble Time (usec)",36]
["Control Preamble Time (usec)",32]
["Frames / Sec",{"$f":"1000/B1","v":200}]
["Ethernet Header (Bytes)",18]
["IP Header  (Bytes)",20]
["UDP Header  (Bytes)",8]
["UDP/IP/Ethernet Header length (Bytes)",{"$f":"SUM(B17:B19)","v":46}]
["UDP Payload Size (Bytes)",{"$f":"'LINK BUDGET'!C16","v":1472},"←◊"]
["Ethernet Packet Size (Bytes)",{"$f":"B21+B20","v":1518}]
["MAC MPDU Header Length (Bytes)",40]
["DL PHY/MAC/IP/TCP Overhead ",{"$f":"(B23+B20)/B21","v":5.8423913043478264E-2}]
[]
["STA's Time between consecutive MPDUs in A-MPDU (usec)",0]
["AP's Time between consecutive MPDUs in A-MPDU (usec)",0]
["DL Inter STA Transmission Time (usec)",8]
[]
["AP Jitter (Gated-Beacon Jitter) (usec) (Jap)",10]
{"$rows_left_out":33}
{"sheet":"UDP traffic","index":6,"n_rows":102,"n_cols":121,"rows_kept":102,"cut":false,"hidden":true,"merged":[[0,3,32,3]]}
["Frame duration (msec)",{"$f":"Input!B1","v":5},null,"Do not update …. Refer to \"Input\" Tab"]
["TDD Ratio",{"$f":"Input!B2","v":"50/50"}]
["CPU PPF (Packet Per Frame) Limit (DL based on TDD Ratio)",{"$f":"Input!B6","v":100}]
["CPU PPF (Packet Per Frame) Limit (UL based on TDD Ratio)",{"$f":"Input!B7","v":100}]
["DL Users Scheduled / frame",{"$f":"Input!B9","v":8}]
["UL Users Scheduled / frame",{"$f":"Input!B10","v":9}]
[]
["Peamble Time (usec)",{"$f":"Input!B14","v":36}]
["Frames / Sec",{"$f":"Input!B16","v":200}]
["Ethernet Header (Bytes)",{"$f":"Input!B17","v":18}]
["IP Header  (Bytes)",{"$f":"Input!B18","v":20}]
["UDP Header  (Bytes)",{"$f":"Input!B19","v":8}]
["UDP/IP/Ethernet Header length (Bytes)",{"$f":"Input!B20","v":46}]
["UDP Payload Size (Bytes)",{"$f":"Input!B21","v":1472}]
["MAC MPDU Header Length (Bytes)",{"$f":"Input!B23","v":40}]
["DL PHY/MAC/IP/TCP Overhead ",{"$f":"Input!B24","v":5.8423913043478264E-2}]
[]
["STA's Time between consecutive MPDUs in A-MPDU (usec)",{"$f":"Input!B26","v":0}]
["AP's Time between consecutive MPDUs in A-MPDU (usec)",{"$f":"Input!B27","v":0}]
["DL Inter STA Transmission Time (usec)",{"$f":"Input!B28","v":8}]
["UL Inter STA Transmission Time (usec)",{"$f":"Input!B32","v":10}]
[]
[]
["DL Useable duration (usec)",{"$f":"Input!B45","v":2463}]
["UL Useable duration (usec)",{"$f":"Input!B46","v":2409}]
["MCS (b/sym)",{"$f":"Input!B47","v":52}]
["Max DL data/frame (KB)",{"$f":"Input!B48","v":3.4515380859375}]
[]
["ARQ ACK (STA --> AP) Time (usec)",{"$f":"Input!B43 + B19","v":78}]
[]
{"$rows_left_out":73}
{"sheet":"LookupTab","index":7,"n_rows":90,"n_cols":16,"rows_kept":90,"cut":false,"hidden":true,"merged":[[36,3,36,6],[7,3,7,6],[7,12,7,15],[22,3,22,6],[22,11,22,14],[24,8,24,10]]}
[]
[null,null,null,null,"Time (usec)"]
[null,null,null,"RTTG",{"$f":"Input!B54","v":37}]
[null,null,null,"TTRG",{"$f":"Input!B53","v":91}]
[null,null,null,"PD(cs)",{"$f":"ROUNDUP(Input!B52,0)","v":54}]
[]
[]
[null,null,null,"2.5 msec",null,null,null,null,"MCS","20 MHz (b/s)","40 MHz (b/s)",null,"Num STAs Scheduled for Traffic in UL"]
[null,null,null,"TDD Ratio",null,"DL Useable Time","UL Useable Time",null,"MCS1",52,108,null,"TDd Ratio","UL STAs (2.5 msec)","UL STAs (5 msec)","UL STAs (10 msec)"]
[null,null,null,"95/5",0.95,{"$f":"$E10*2500 - $E$4 + $E$5","v":2338},{"$f":"(1-$E10)*2500 - $E$3 - $E$5","v":34.000000000000114},null,"MCS2",78,162,null,"95/5",1,1,2]
[null,null,null,"90/10",0.9,{"$f":"$E11*2500 - $E$4 + $E$5","v":2213},{"$f":"(1-$E11)*2500 - $E$3 - $E$5","v":158.99999999999994},null,"MCS3",104,216,null,"90/10",1,1,2]
[null,null,null,"85/15",0.85,2088,284.00000000000006,null,"MCS4",156,324,null,"85/15",1,1,3]
[null,null,null,"80/20",0.8,1963,408.99999999999989,null,"MCS5",208,432,null,"80/20",1,2,5]
[null,null,null,"75/25",0.75,1838,534,null,"MCS6",234,486,null,"75/25",1,3,6]
[null,null,null,"50/50",0.5,1213,1159,null,"MCS7",260,540,null,"50/50",4,9,18]
[null,null,null,"30/70",0.3,713,1659,null,"MCS9",104,216,null,"30/70",7,15,30]
[null,null,null,"10/90",0.1,213,2159,null,"MCS10",156,324,null,"10/90",8,17,34]
[null,null,null,"5/95",0.05,88,2284,null,"MCS11",208,432,null,"5/95",9,18,36]
[null,null,null,null,null,null,null,null,"MCS12",312,648]
[null,null,null,null,null,null,null,null,"MCS13",416,864]
[null,null,null,null,null,null,null,null,"MCS14",468,972]
[null,null,null,null,null,null,null,null,"MCS15",520,1080]
[null,null,null,"5 msec"]
[null,null,null,"TDD Ratio",null,"DL Useable Time","UL Useable Time"]
[null,null,null,"95/5",0.95,{"$f":"$E25*5000 - $E$4 + $E$5","v":4713},{"$f":"(1-$E25)*5000 - $E$3 -  $E$5","v":159.00000000000023},null,"CPU PPF (DL ONLY)"]
[null,null,null,"90/10",0.9,{"$f":"$E26*5000 - $E$4 + $E$5","v":4463},{"$f":"(1-$E26)*5000 - $E$3 -  $E$5","v":408.99999999999989},null,"Frame Duration","TDd Ratio","PPF"]
[null,null,null,"85/15",0.85,4213,659.00000000000011,null,2.5,"50/50",100]
[null,null,null,"80/20",0.8,3963,908.99999999999977,null,5,"50/50",200]
[null,null,null,"75/25",0.75,3713,1159,null,10,"50/50",400]
[null,null,null,"50/50",0.5,2463,2409]
{"$rows_left_out":61}
{"sheet":"User Traffic Profile 1","index":8,"n_rows":128,"n_cols":6,"rows_kept":128,"cut":false,"hidden":true,"merged":[]}
[null,"% Active STAs \nPer Frame","Packet Size \n(Bytes)","Data Rate / STA\n(Mbps)","PPS / STA","Packet Interarrival \nTime (msec)"]
["Downlink",1,1500,10,{"$f":"D2*1024*1024/(8*C2)","v":873.81333333333339},{"$f":"(1/E2)*1000","v":1.1444091796875}]
["Uplink",1,400,2,{"$f":"D3*1024*1024/(8*C3)","v":655.36},{"$f":"(1/E3)*1000","v":1.52587890625}]
[]
[]
[]
[]
["Connected\nSTAs","Active DL \nSTAs/Frame","DL STAs Ready\nFor Scheduling /Frame","Active UL \nSTAs/Frame","UL STAs Ready\nFor Scheduling /Frame","Idle UL \nSTAs / Frame"]
[1,{"$f":"$B$2*A9","v":1},{"$f":"ROUNDUP(B9,0)","v":1},{"$f":"$B$3*A9","v":1},{"$f":"ROUNDUP(D9,0)","v":1},{"$f":"A9-E9","v":0}]
[2,2,{"$f":"ROUNDUP(B10,0)","v":2},2,2,{"$f":"A10-E10","v":0}]
[3,3,3,3,3,0]
[4,4,4,4,4,0]
[5,5,5,5,5,0]
[6,6,6,6,6,0]
[7,7,7,7,7,0]
[8,8,8,8,8,0]
[9,9,9,9,9,0]
[10,10,10,10,10,0]
[11,11,11,11,11,0]
[12,12,12,12,12,0]
[13,13,13,13,13,0]
[14,14,14,14,14,0]
[15,15,15,15,15,0]
[16,16,16,16,16,0]
[17,17,17,17,17,0]
[18,18,18,18,18,0]
[19,19,19,19,19,0]
[20,20,20,20,20,0]
[21,21,21,21,21,0]
[22,22,22,22,22,0]
{"$rows_left_out":98}